Ticket #1019: gcc-5.1.0-amd64-final-tests

File gcc-5.1.0-amd64-final-tests, 70.5 KB (added by William Harrington, 8 years ago)

Test resuilts of Ch10 Pure64 GCC AMD64

Line 
1make[1]: Entering directory '/sources/gcc-build'
2make[2]: Entering directory '/sources/gcc-build/fixincludes'
3autogen -T ../../gcc-5.1.0/fixincludes/check.tpl ../../gcc-5.1.0/fixincludes/inclhack.def
4make[2]: autogen: Command not found
5Makefile:176: recipe for target 'check' failed
6make[2]: *** [check] Error 127
7make[2]: Leaving directory '/sources/gcc-build/fixincludes'
8Makefile:3619: recipe for target 'check-fixincludes' failed
9make[1]: *** [check-fixincludes] Error 2
10make[2]: Entering directory '/sources/gcc-build/gcc'
11make[2]: Entering directory '/sources/gcc-build/intl'
12make[2]: Nothing to be done for 'check'.
13make[2]: Leaving directory '/sources/gcc-build/intl'
14make[2]: Entering directory '/sources/gcc-build/libbacktrace'
15true  DO=all multi-do # make
16make  btest stest
17make[3]: Entering directory '/sources/gcc-build/libbacktrace'
18gcc -isystem /usr/include -DHAVE_CONFIG_H -I. -I../../gcc-5.1.0/libbacktrace  -I ../../gcc-5.1.0/libbacktrace/../include -I ../../gcc-5.1.0/libbacktrace/../libgcc -I ../libgcc  -funwind-tables -frandom-seed=btest-btest.o -W -Wall -Wwrite-strings -Wstrict-prototypes -Wmissing-prototypes -Wold-style-definition -Wmissing-format-attribute -Wcast-qual  -g -O -O3 -march=native -mtune=native -pipe -fomit-frame-pointer -s -c -o btest-btest.o `test -f 'btest.c' || echo '../../gcc-5.1.0/libbacktrace/'`btest.c
19make[2]: Entering directory '/sources/gcc-build/libcpp'
20make[2]: Nothing to be done for 'check'.
21make[2]: Leaving directory '/sources/gcc-build/libcpp'
22make[2]: Entering directory '/sources/gcc-build/libdecnumber'
23make[2]: Nothing to be done for 'check'.
24make[2]: Leaving directory '/sources/gcc-build/libdecnumber'
25make[2]: Entering directory '/sources/gcc-build/libiberty'
26make[3]: Entering directory '/sources/gcc-build/libiberty/testsuite'
27gcc -isystem /usr/include -DHAVE_CONFIG_H -O3 -march=native -mtune=native -pipe -fomit-frame-pointer -s -I.. -I../../../gcc-5.1.0/libiberty/testsuite/../../include  -o test-demangle \
28        ../../../gcc-5.1.0/libiberty/testsuite/test-demangle.c ../libiberty.a
29gcc -isystem /usr/include -DHAVE_CONFIG_H -I. -I../../gcc-5.1.0/libbacktrace  -I ../../gcc-5.1.0/libbacktrace/../include -I ../../gcc-5.1.0/libbacktrace/../libgcc -I ../libgcc  -funwind-tables -frandom-seed=stest.o -W -Wall -Wwrite-strings -Wstrict-prototypes -Wmissing-prototypes -Wold-style-definition -Wmissing-format-attribute -Wcast-qual  -O3 -march=native -mtune=native -pipe -fomit-frame-pointer -s -c ../../gcc-5.1.0/libbacktrace/stest.c
30/bin/sh ./libtool --tag=CC   --mode=link gcc -isystem /usr/include -funwind-tables -frandom-seed=btest -W -Wall -Wwrite-strings -Wstrict-prototypes -Wmissing-prototypes -Wold-style-definition -Wmissing-format-attribute -Wcast-qual  -g -O -O3 -march=native -mtune=native -pipe -fomit-frame-pointer -s  -Wl,-rpath-link,/usr/lib:/lib -o btest btest-btest.o libbacktrace.la
31gcc -isystem /usr/include -DHAVE_CONFIG_H -O3 -march=native -mtune=native -pipe -fomit-frame-pointer -s -I.. -I../../../gcc-5.1.0/libiberty/testsuite/../../include  -DHAVE_CONFIG_H -I.. -o test-pexecute \
32        ../../../gcc-5.1.0/libiberty/testsuite/test-pexecute.c ../libiberty.a
33libtool: link: gcc -isystem /usr/include -funwind-tables -frandom-seed=btest -W -Wall -Wwrite-strings -Wstrict-prototypes -Wmissing-prototypes -Wold-style-definition -Wmissing-format-attribute -Wcast-qual -g -O -O3 -march=native -mtune=native -pipe -fomit-frame-pointer -s -Wl,-rpath-link -Wl,/usr/lib:/lib -o btest btest-btest.o  ./.libs/libbacktrace.a
34Making a new config file...
35/bin/sh ./libtool --tag=CC   --mode=link gcc -isystem /usr/include -funwind-tables -frandom-seed=stest -W -Wall -Wwrite-strings -Wstrict-prototypes -Wmissing-prototypes -Wold-style-definition -Wmissing-format-attribute -Wcast-qual  -O3 -march=native -mtune=native -pipe -fomit-frame-pointer -s  -Wl,-rpath-link,/usr/lib:/lib -o stest stest.o libbacktrace.la
36libtool: link: gcc -isystem /usr/include -funwind-tables -frandom-seed=stest -W -Wall -Wwrite-strings -Wstrict-prototypes -Wmissing-prototypes -Wold-style-definition -Wmissing-format-attribute -Wcast-qual -O3 -march=native -mtune=native -pipe -fomit-frame-pointer -s -Wl,-rpath-link -Wl,/usr/lib:/lib -o stest stest.o  ./.libs/libbacktrace.a
37make[3]: Leaving directory '/sources/gcc-build/libbacktrace'
38make  check-TESTS
39make[3]: Entering directory '/sources/gcc-build/libbacktrace'
40echo "set tmpdir /sources/gcc-build/gcc/testsuite" >> ./site.tmp
41no debug info in ELF executable
42no debug info in ELF executable
43no debug info in ELF executable
44no debug info in ELF executable
45no debug info in ELF executable
46no debug info in ELF executable
47no debug info in ELF executable
48test1: not enough frames; got 0, expected at least 3
49no debug info in ELF executable
50no debug info in ELF executable
51no debug info in ELF executable
52no debug info in ELF executable
53no debug info in ELF executable
54no debug info in ELF executable
55no debug info in ELF executable
56test3: [0]: NULL syminfo name
57test3: [1]: NULL syminfo name
58test3: [2]: NULL syminfo name
59no debug info in ELF executable
60test5: NULL syminfo name
61FAIL: backtrace_full noinline
62FAIL: backtrace_full inline
63FAIL: backtrace_simple noinline
64FAIL: backtrace_simple inline
65FAIL: backtrace_syminfo variable
66FAIL: btest
67rm -rf testsuite/gcc-parallel
68PASS: stest
69make[3]: Entering directory '/sources/gcc-build/gcc'
70===================
711 of 2 tests failed
72===================
73Makefile:507: recipe for target 'check-TESTS' failed
74make[3]: *** [check-TESTS] Error 1
75make[3]: Leaving directory '/sources/gcc-build/libbacktrace'
76Makefile:598: recipe for target 'check-am' failed
77make[2]: *** [check-am] Error 2
78make[2]: Target 'check' not remade because of errors.
79make[2]: Leaving directory '/sources/gcc-build/libbacktrace'
80Makefile:7302: recipe for target 'check-libbacktrace' failed
81make[1]: *** [check-libbacktrace] Error 2
82make[2]: Entering directory '/sources/gcc-build/lto-plugin'
83make[2]: Leaving directory '/sources/gcc-build/lto-plugin'
84make[2]: Entering directory '/sources/gcc-build/libcc1'
85make  check-am
86gcc -isystem /usr/include -DHAVE_CONFIG_H -O3 -march=native -mtune=native -pipe -fomit-frame-pointer -s -I.. -I../../../gcc-5.1.0/libiberty/testsuite/../../include  -DHAVE_CONFIG_H -I.. -o test-expandargv \
87        ../../../gcc-5.1.0/libiberty/testsuite/test-expandargv.c ../libiberty.a
88make[3]: Entering directory '/sources/gcc-build/libcc1'
89make[3]: Leaving directory '/sources/gcc-build/libcc1'
90make[2]: Leaving directory '/sources/gcc-build/libcc1'
91make[2]: Entering directory '/sources/gcc-build/x86_64-unknown-linux-gnu/libstdc++-v3'
92Making check in include
93make[3]: Entering directory '/sources/gcc-build/x86_64-unknown-linux-gnu/libstdc++-v3/include'
94make[3]: Nothing to be done for 'check'.
95make[3]: Leaving directory '/sources/gcc-build/x86_64-unknown-linux-gnu/libstdc++-v3/include'
96Making check in libsupc++
97make[3]: Entering directory '/sources/gcc-build/x86_64-unknown-linux-gnu/libstdc++-v3/libsupc++'
98make[3]: Nothing to be done for 'check'.
99make[3]: Leaving directory '/sources/gcc-build/x86_64-unknown-linux-gnu/libstdc++-v3/libsupc++'
100Making check in src
101gcc -isystem /usr/include -DHAVE_CONFIG_H -O3 -march=native -mtune=native -pipe -fomit-frame-pointer -s -I.. -I../../../gcc-5.1.0/libiberty/testsuite/../../include  -DHAVE_CONFIG_H -I.. -o test-strtol \
102        ../../../gcc-5.1.0/libiberty/testsuite/test-strtol.c ../libiberty.a
103make[3]: Entering directory '/sources/gcc-build/x86_64-unknown-linux-gnu/libstdc++-v3/src'
104Making check in c++98
105make[4]: Entering directory '/sources/gcc-build/x86_64-unknown-linux-gnu/libstdc++-v3/src/c++98'
106make[4]: Nothing to be done for 'check'.
107make[4]: Leaving directory '/sources/gcc-build/x86_64-unknown-linux-gnu/libstdc++-v3/src/c++98'
108Making check in c++11
109make[4]: Entering directory '/sources/gcc-build/x86_64-unknown-linux-gnu/libstdc++-v3/src/c++11'
110make[4]: Nothing to be done for 'check'.
111make[4]: Leaving directory '/sources/gcc-build/x86_64-unknown-linux-gnu/libstdc++-v3/src/c++11'
112make[4]: Entering directory '/sources/gcc-build/x86_64-unknown-linux-gnu/libstdc++-v3/src'
113make[4]: Nothing to be done for 'check-am'.
114make[4]: Leaving directory '/sources/gcc-build/x86_64-unknown-linux-gnu/libstdc++-v3/src'
115make[3]: Leaving directory '/sources/gcc-build/x86_64-unknown-linux-gnu/libstdc++-v3/src'
116Making check in doc
117make[3]: Entering directory '/sources/gcc-build/x86_64-unknown-linux-gnu/libstdc++-v3/doc'
118make[3]: Nothing to be done for 'check'.
119make[3]: Leaving directory '/sources/gcc-build/x86_64-unknown-linux-gnu/libstdc++-v3/doc'
120Making check in po
121make[3]: Entering directory '/sources/gcc-build/x86_64-unknown-linux-gnu/libstdc++-v3/po'
122/bin/sh /sources/gcc-5.1.0/libstdc++-v3/../mkinstalldirs /sources/gcc-build/x86_64-unknown-linux-gnu/libstdc++-v3/po/share/locale
123mkdir -p -- /sources/gcc-build/x86_64-unknown-linux-gnu/libstdc++-v3/po/share/locale
124catalogs='de.mo fr.mo'; \
125for cat in $catalogs; do \
126  cat=`basename $cat`; \
127  lang=`echo $cat | sed 's/\.mo$//'`; \
128  install_dir=/sources/gcc-build/x86_64-unknown-linux-gnu/libstdc++-v3/po/share/locale/$lang/LC_MESSAGES; \
129  /bin/sh /sources/gcc-5.1.0/libstdc++-v3/../mkinstalldirs $install_dir; \
130  /tools/bin/install -c -m 644 $cat $install_dir/libstdc++.mo; \
131done
132./test-demangle < ../../../gcc-5.1.0/libiberty/testsuite/demangle-expected
133./test-demangle: 897 tests, 0 failures
134./test-demangle < ../../../gcc-5.1.0/libiberty/testsuite/d-demangle-expected
135./test-demangle: 230 tests, 0 failures
136./test-pexecute
137mkdir -p -- /sources/gcc-build/x86_64-unknown-linux-gnu/libstdc++-v3/po/share/locale/de/LC_MESSAGES
138./test-expandargv
139PASS: test-expandargv-0.
140PASS: test-expandargv-1.
141PASS: test-expandargv-2.
142PASS: test-expandargv-3.
143PASS: test-expandargv-4.
144PASS: test-expandargv-5.
145PASS: test-expandargv-6.
146./test-strtol
147PASS: test-strtol-0.
148PASS: test-strtol-1.
149PASS: test-strtol-2.
150PASS: test-strtol-3.
151PASS: test-strtol-4.
152PASS: test-strtol-5.
153PASS: test-strtol-6.
154PASS: test-strtol-7.
155PASS: test-strtol-8.
156PASS: test-strtol-9.
157PASS: test-strtol-10.
158PASS: test-strtol-11.
159PASS: test-strtol-12.
160PASS: test-strtol-13.
161PASS: test-strtol-14.
162PASS: test-strtol-15.
163PASS: test-strtol-16.
164PASS: test-strtol-17.
165PASS: test-strtol-18.
166PASS: test-strtol-19.
167PASS: test-strtol-20.
168make[3]: Leaving directory '/sources/gcc-build/libiberty/testsuite'
169make[2]: Leaving directory '/sources/gcc-build/libiberty'
170rm -rf testsuite/g++-parallel
171mkdir -p -- /sources/gcc-build/x86_64-unknown-linux-gnu/libstdc++-v3/po/share/locale/fr/LC_MESSAGES
172make[3]: Leaving directory '/sources/gcc-build/x86_64-unknown-linux-gnu/libstdc++-v3/po'
173Making check in testsuite
174make[3]: Entering directory '/sources/gcc-build/x86_64-unknown-linux-gnu/libstdc++-v3/testsuite'
175make  check-DEJAGNU
176make[4]: Entering directory '/sources/gcc-build/x86_64-unknown-linux-gnu/libstdc++-v3/testsuite'
177Making a new site.exp file...
178make[3]: Entering directory '/sources/gcc-build/gcc'
179AR="ar"; export AR; \
180RANLIB="ranlib"; export RANLIB; \
181if [ -z "" ] && [ "-j" = "-j" ]; then \
182  rm -rf normal-parallel || true; \
183  mkdir normal-parallel; \
184  make  check-DEJAGNUnormal1 check-DEJAGNUnormal2 check-DEJAGNUnormal3 check-DEJAGNUnormal4 check-DEJAGNUnormal5 check-DEJAGNUnormal6 check-DEJAGNUnormal7 check-DEJAGNUnormal8 check-DEJAGNUnormal9 check-DEJAGNUnormal10 check-DEJAGNUnormal11 check-DEJAGNUnormal12 check-DEJAGNUnormal13 check-DEJAGNUnormal14 check-DEJAGNUnormal15 check-DEJAGNUnormal16 check-DEJAGNUnormal17 check-DEJAGNUnormal18 check-DEJAGNUnormal19 check-DEJAGNUnormal20 check-DEJAGNUnormal21 check-DEJAGNUnormal22 check-DEJAGNUnormal23 check-DEJAGNUnormal24 check-DEJAGNUnormal25 check-DEJAGNUnormal26 check-DEJAGNUnormal27 check-DEJAGNUnormal28 check-DEJAGNUnormal29 check-DEJAGNUnormal30 check-DEJAGNUnormal31 check-DEJAGNUnormal32 check-DEJAGNUnormal33 check-DEJAGNUnormal34 check-DEJAGNUnormal35 check-DEJAGNUnormal36 check-DEJAGNUnormal37 check-DEJAGNUnormal38 check-DEJAGNUnormal39 check-DEJAGNUnormal40 check-DEJAGNUnormal41 check-DEJAGNUnormal42 check-DEJAGNUnormal43 check-DEJAGNUnormal44 check-DEJAGNUnormal45 check-DEJAGNUnormal46 check-DEJAGNUnormal47 check-DEJAGNUnormal48 check-DEJAGNUnormal49 check-DEJAGNUnormal50 check-DEJAGNUnormal51 check-DEJAGNUnormal52 check-DEJAGNUnormal53 check-DEJAGNUnormal54 check-DEJAGNUnormal55 check-DEJAGNUnormal56 check-DEJAGNUnormal57 check-DEJAGNUnormal58 check-DEJAGNUnormal59 check-DEJAGNUnormal60 check-DEJAGNUnormal61 check-DEJAGNUnormal62 check-DEJAGNUnormal63 check-DEJAGNUnormal64 check-DEJAGNUnormal65 check-DEJAGNUnormal66 check-DEJAGNUnormal67 check-DEJAGNUnormal68 check-DEJAGNUnormal69 check-DEJAGNUnormal70 check-DEJAGNUnormal71 check-DEJAGNUnormal72 check-DEJAGNUnormal73 check-DEJAGNUnormal74 check-DEJAGNUnormal75 check-DEJAGNUnormal76 check-DEJAGNUnormal77 check-DEJAGNUnormal78 check-DEJAGNUnormal79 check-DEJAGNUnormal80 check-DEJAGNUnormal81 check-DEJAGNUnormal82 check-DEJAGNUnormal83 check-DEJAGNUnormal84 check-DEJAGNUnormal85 check-DEJAGNUnormal86 check-DEJAGNUnormal87 check-DEJAGNUnormal88 check-DEJAGNUnormal89 check-DEJAGNUnormal90 check-DEJAGNUnormal91 check-DEJAGNUnormal92 check-DEJAGNUnormal93 check-DEJAGNUnormal94 check-DEJAGNUnormal95 check-DEJAGNUnormal96 check-DEJAGNUnormal97 check-DEJAGNUnormal98 check-DEJAGNUnormal99 check-DEJAGNUnormal100 check-DEJAGNUnormal101 check-DEJAGNUnormal102 check-DEJAGNUnormal103 check-DEJAGNUnormal104 check-DEJAGNUnormal105 check-DEJAGNUnormal106 check-DEJAGNUnormal107 check-DEJAGNUnormal108 check-DEJAGNUnormal109 check-DEJAGNUnormal110 check-DEJAGNUnormal111 check-DEJAGNUnormal112 check-DEJAGNUnormal113 check-DEJAGNUnormal114 check-DEJAGNUnormal115 check-DEJAGNUnormal116 check-DEJAGNUnormal117 check-DEJAGNUnormal118 check-DEJAGNUnormal119 check-DEJAGNUnormal120 check-DEJAGNUnormal121 check-DEJAGNUnormal122 check-DEJAGNUnormal123 check-DEJAGNUnormal124 check-DEJAGNUnormal125 check-DEJAGNUnormal126 check-DEJAGNUnormal127 check-DEJAGNUnormal128; \
185  rm -rf normal-parallel || true; \
186  for idx in 1 2 3 4 5 6 7 8 9 10 11 12 13 14 15 16 17 18 19 20 21 22 23 24 25 26 27 28 29 30 31 32 33 34 35 36 37 38 39 40 41 42 43 44 45 46 47 48 49 50 51 52 53 54 55 56 57 58 59 60 61 62 63 64 65 66 67 68 69 70 71 72 73 74 75 76 77 78 79 80 81 82 83 84 85 86 87 88 89 90 91 92 93 94 95 96 97 98 99 100 101 102 103 104 105 106 107 108 109 110 111 112 113 114 115 116 117 118 119 120 121 122 123 124 125 126 127 128; do \
187    if [ -d normal$idx ]; then \
188      mv -f normal$idx/libstdc++.sum normal$idx/libstdc++.sum.sep; \
189      mv -f normal$idx/libstdc++.log normal$idx/libstdc++.log.sep; \
190    fi; \
191  done; \
192  /bin/sh ../../../../gcc-5.1.0/libstdc++-v3/testsuite/../../contrib/dg-extract-results.sh \
193    normal[0-9]*/libstdc++.sum.sep > libstdc++.sum; \
194  /bin/sh ../../../../gcc-5.1.0/libstdc++-v3/testsuite/../../contrib/dg-extract-results.sh -L \
195    normal[0-9]*/libstdc++.log.sep > libstdc++.log; \
196  exit 0; \
197fi; \
198srcdir=`CDPATH="${ZSH_VERSION+.}:" && cd ../../../../gcc-5.1.0/libstdc++-v3/testsuite && pwd`; export srcdir; \
199EXPECT=expect; export EXPECT; \
200runtest=runtest; \
201if [ -z "$runtest" ]; then runtest=runtest; fi; \
202tool=libstdc++; \
203if [ -n "" ]; then \
204  if [ -f normal-parallel/finished ]; then rm -rf ""; exit 0; fi; \
205  GCC_RUNTEST_PARALLELIZE_DIR=`${PWDCMD-pwd}`/normal-parallel; \
206  export GCC_RUNTEST_PARALLELIZE_DIR; \
207  cd ""; \
208fi; \
209if /bin/sh -c "$runtest --version" > /dev/null 2>&1; then \
210  $runtest  --tool $tool --srcdir $srcdir \
211            ; \
212  if [ -n "" ]; then \
213    touch $GCC_RUNTEST_PARALLELIZE_DIR/finished; \
214  fi; \
215else \
216  echo "WARNING: could not find \`runtest'" 1>&2; :;\
217fi
218make[5]: Entering directory '/sources/gcc-build/x86_64-unknown-linux-gnu/libstdc++-v3/testsuite'
219(rootme=`${PWDCMD-pwd}`; export rootme; \
220srcdir=`cd ../../gcc-5.1.0/gcc; ${PWDCMD-pwd}` ; export srcdir ; \
221if [ -n "" ] \
222   && [ -n "$GCC_RUNTEST_PARALLELIZE_DIR" ] \
223   && [ -f testsuite/gcc-parallel/finished ]; then \
224  rm -rf testsuite/gcc; \
225else \
226  cd testsuite/gcc; \
227  rm -f tmp-site.exp; \
228  sed '/set tmpdir/ s|testsuite$|testsuite/gcc|' \
229        < ../../site.exp > tmp-site.exp; \
230  /bin/sh ${srcdir}/../move-if-change tmp-site.exp site.exp; \
231  EXPECT=`if [ -f ${rootme}/../expect/expect ] ; then echo ${rootme}/../expect/expect ; else echo expect ; fi` ; export EXPECT ; \
232  if [ -f ${rootme}/../expect/expect ] ; then  \
233    TCL_LIBRARY=`cd .. ; cd ${srcdir}/../tcl/library ; ${PWDCMD-pwd}` ; \
234    export TCL_LIBRARY ; \
235  fi ; \
236  `if [ -f ${srcdir}/../dejagnu/runtest ] ; then echo ${srcdir}/../dejagnu/runtest ; else echo runtest; fi` --tool gcc ; \
237  if [ -n "$GCC_RUNTEST_PARALLELIZE_DIR" ] ; then \
238    touch ${rootme}/testsuite/gcc-parallel/finished; \
239  fi ; \
240fi )
241WARNING: Couldn't find the global config file.
242Test Run By root on Tue May  5 01:58:45 2015
243Native configuration is x86_64-unknown-linux-gnu
244
245                === gcc tests ===
246
247Schedule of variations:
248    unix
249
250Running target unix
251Using /tools/share/dejagnu/baseboards/unix.exp as board description file for target.
252Using /tools/share/dejagnu/config/unix.exp as generic interface file for target.
253Using /sources/gcc-5.1.0/gcc/testsuite/config/default.exp as tool-and-target-specific interface file.
254Running /sources/gcc-5.1.0/gcc/testsuite/gcc.c-torture/compile/compile.exp ...
255(rootme=`${PWDCMD-pwd}`; export rootme; \
256srcdir=`cd ../../gcc-5.1.0/gcc; ${PWDCMD-pwd}` ; export srcdir ; \
257if [ -n "" ] \
258   && [ -n "$GCC_RUNTEST_PARALLELIZE_DIR" ] \
259   && [ -f testsuite/g++-parallel/finished ]; then \
260  rm -rf testsuite/g++; \
261else \
262  cd testsuite/g++; \
263  rm -f tmp-site.exp; \
264  sed '/set tmpdir/ s|testsuite$|testsuite/g++|' \
265        < ../../site.exp > tmp-site.exp; \
266  /bin/sh ${srcdir}/../move-if-change tmp-site.exp site.exp; \
267  EXPECT=`if [ -f ${rootme}/../expect/expect ] ; then echo ${rootme}/../expect/expect ; else echo expect ; fi` ; export EXPECT ; \
268  if [ -f ${rootme}/../expect/expect ] ; then  \
269    TCL_LIBRARY=`cd .. ; cd ${srcdir}/../tcl/library ; ${PWDCMD-pwd}` ; \
270    export TCL_LIBRARY ; \
271  fi ; \
272  `if [ -f ${srcdir}/../dejagnu/runtest ] ; then echo ${srcdir}/../dejagnu/runtest ; else echo runtest; fi` --tool g++ ; \
273  if [ -n "$GCC_RUNTEST_PARALLELIZE_DIR" ] ; then \
274    touch ${rootme}/testsuite/g++-parallel/finished; \
275  fi ; \
276fi )
277WARNING: Couldn't find the global config file.
278Test Run By root on Tue May  5 01:58:45 2015
279Native configuration is x86_64-unknown-linux-gnu
280
281                === g++ tests ===
282
283Schedule of variations:
284    unix
285
286Running target unix
287Using /tools/share/dejagnu/baseboards/unix.exp as board description file for target.
288Using /tools/share/dejagnu/config/unix.exp as generic interface file for target.
289Using /sources/gcc-5.1.0/gcc/testsuite/config/default.exp as tool-and-target-specific interface file.
290Running /sources/gcc-5.1.0/gcc/testsuite/g++.dg/asan/asan.exp ...
291WARNING: Couldn't find the global config file.
292Test Run By root on Tue May  5 01:58:48 2015
293Native configuration is x86_64-unknown-linux-gnu
294
295                === libstdc++ tests ===
296
297Schedule of variations:
298    unix
299
300Running target unix
301Using /tools/share/dejagnu/baseboards/unix.exp as board description file for target.
302Using /tools/share/dejagnu/config/unix.exp as generic interface file for target.
303Using /sources/gcc-5.1.0/libstdc++-v3/testsuite/config/default.exp as tool-and-target-specific interface file.
304Running /sources/gcc-5.1.0/libstdc++-v3/testsuite/libstdc++-abi/abi.exp ...
305Running /sources/gcc-5.1.0/libstdc++-v3/testsuite/libstdc++-dg/conformance.exp ...
306FAIL: 20_util/enable_shared_from_this/cons/constexpr.cc (test for excess errors)
307Running /sources/gcc-5.1.0/gcc/testsuite/g++.dg/bprob/bprob.exp ...
308Running /sources/gcc-5.1.0/gcc/testsuite/g++.dg/charset/charset.exp ...
309Running /sources/gcc-5.1.0/gcc/testsuite/g++.dg/cilk-plus/cilk-plus.exp ...
310FAIL: 20_util/shared_ptr/cons/constexpr.cc (test for excess errors)
311FAIL: 20_util/unique_ptr/cons/constexpr.cc (test for excess errors)
312FAIL: 20_util/weak_ptr/cons/constexpr.cc (test for excess errors)
313Running /sources/gcc-5.1.0/gcc/testsuite/g++.dg/compat/compat.exp ...
314Running /sources/gcc-5.1.0/gcc/testsuite/g++.dg/compat/struct-layout-1.exp ...
315Running /sources/gcc-5.1.0/gcc/testsuite/g++.dg/debug/debug.exp ...
316Running /sources/gcc-5.1.0/gcc/testsuite/g++.dg/debug/dwarf2/dwarf2.exp ...
317Running /sources/gcc-5.1.0/gcc/testsuite/g++.dg/dfp/dfp.exp ...
318Running /sources/gcc-5.1.0/gcc/testsuite/g++.dg/dg.exp ...
319Running /sources/gcc-5.1.0/gcc/testsuite/gcc.c-torture/execute/builtins/builtins.exp ...
320Running /sources/gcc-5.1.0/gcc/testsuite/gcc.c-torture/execute/execute.exp ...
321Running /sources/gcc-5.1.0/gcc/testsuite/g++.dg/gcov/gcov.exp ...
322Running /sources/gcc-5.1.0/gcc/testsuite/g++.dg/goacc-gomp/goacc-gomp.exp ...
323Running /sources/gcc-5.1.0/gcc/testsuite/g++.dg/goacc/goacc.exp ...
324Running /sources/gcc-5.1.0/gcc/testsuite/g++.dg/gomp/gomp.exp ...
325Running /sources/gcc-5.1.0/gcc/testsuite/g++.dg/graphite/graphite.exp ...
326Running /sources/gcc-5.1.0/gcc/testsuite/g++.dg/guality/guality.exp ...
327Running /sources/gcc-5.1.0/gcc/testsuite/g++.dg/lto/lto.exp ...
328Running /sources/gcc-5.1.0/gcc/testsuite/g++.dg/pch/pch.exp ...
329Running /sources/gcc-5.1.0/gcc/testsuite/g++.dg/plugin/plugin.exp ...
330Running /sources/gcc-5.1.0/gcc/testsuite/g++.dg/simulate-thread/simulate-thread.exp ...
331Running /sources/gcc-5.1.0/gcc/testsuite/g++.dg/special/ecos.exp ...
332Running /sources/gcc-5.1.0/gcc/testsuite/g++.dg/tls/tls.exp ...
333XPASS: g++.dg/tls/thread_local-order2.C  -std=c++11 execution test
334XPASS: g++.dg/tls/thread_local-order2.C  -std=c++14 execution test
335Running /sources/gcc-5.1.0/gcc/testsuite/g++.dg/tm/tm.exp ...
336FAIL: 25_algorithms/sort/34095.cc (test for excess errors)
337Running /sources/gcc-5.1.0/gcc/testsuite/g++.dg/torture/dg-torture.exp ...
338Running /sources/gcc-5.1.0/gcc/testsuite/g++.dg/torture/stackalign/stackalign.exp ...
339Running /sources/gcc-5.1.0/gcc/testsuite/g++.dg/tree-prof/tree-prof.exp ...
340Running /sources/gcc-5.1.0/gcc/testsuite/g++.dg/tsan/tsan.exp ...
341Running /sources/gcc-5.1.0/gcc/testsuite/g++.dg/ubsan/ubsan.exp ...
342Running /sources/gcc-5.1.0/gcc/testsuite/g++.dg/vect/vect.exp ...
343Running /sources/gcc-5.1.0/gcc/testsuite/g++.old-deja/old-deja.exp ...
344Running /sources/gcc-5.1.0/gcc/testsuite/gcc.c-torture/execute/ieee/ieee.exp ...
345Running /sources/gcc-5.1.0/gcc/testsuite/gcc.c-torture/unsorted/unsorted.exp ...
346
347Running /sources/gcc-5.1.0/gcc/testsuite/gcc.dg/asan/asan.exp ...
348Running /sources/gcc-5.1.0/gcc/testsuite/gcc.dg/atomic/atomic.exp ...
349Running /sources/gcc-5.1.0/gcc/testsuite/gcc.dg/autopar/autopar.exp ...
350Running /sources/gcc-5.1.0/gcc/testsuite/gcc.dg/charset/charset.exp ...
351Running /sources/gcc-5.1.0/gcc/testsuite/gcc.dg/cilk-plus/cilk-plus.exp ...
352Running /sources/gcc-5.1.0/gcc/testsuite/gcc.dg/compat/compat.exp ...
353Running /sources/gcc-5.1.0/gcc/testsuite/gcc.dg/compat/struct-layout-1.exp ...
354Running /sources/gcc-5.1.0/gcc/testsuite/gcc.dg/cpp/cpp.exp ...
355Running /sources/gcc-5.1.0/gcc/testsuite/gcc.dg/cpp/trad/trad.exp ...
356Running /sources/gcc-5.1.0/gcc/testsuite/gcc.dg/debug/debug.exp ...
357Running /sources/gcc-5.1.0/gcc/testsuite/gcc.dg/debug/dwarf2/dwarf2.exp ...
358Running /sources/gcc-5.1.0/gcc/testsuite/gcc.dg/dfp/dfp.exp ...
359Running /sources/gcc-5.1.0/gcc/testsuite/gcc.dg/dg.exp ...
360FAIL: 30_threads/future/cons/constexpr.cc (test for excess errors)
361FAIL: 30_threads/shared_future/cons/constexpr.cc (test for excess errors)
362Running /sources/gcc-5.1.0/gcc/testsuite/gcc.dg/fixed-point/fixed-point.exp ...
363Running /sources/gcc-5.1.0/gcc/testsuite/gcc.dg/format/format.exp ...
364Running /sources/gcc-5.1.0/gcc/testsuite/gcc.dg/goacc-gomp/goacc-gomp.exp ...
365Running /sources/gcc-5.1.0/gcc/testsuite/gcc.dg/goacc/goacc.exp ...
366Running /sources/gcc-5.1.0/gcc/testsuite/gcc.dg/gomp/gomp.exp ...
367Running /sources/gcc-5.1.0/gcc/testsuite/gcc.dg/graphite/graphite.exp ...
368Running /sources/gcc-5.1.0/gcc/testsuite/gcc.dg/guality/guality.exp ...
369Running /sources/gcc-5.1.0/gcc/testsuite/gcc.dg/ipa/ipa.exp ...
370Running /sources/gcc-5.1.0/gcc/testsuite/gcc.dg/lto/lto.exp ...
371
372                === g++ Summary ===
373
374# of expected passes            93263
375# of unexpected successes       2
376# of expected failures          339
377# of unsupported tests          3645
378/sources/gcc-build/gcc/testsuite/g++/../../xg++  version 5.1.0 (GCC)
379
380make[3]: Leaving directory '/sources/gcc-build/gcc'
381WARNING: Couldn't find the global config file.
382Test Run By root on Tue May  5 03:38:16 2015
383Native configuration is x86_64-unknown-linux-gnu
384
385                === libstdc++ tests ===
386
387Schedule of variations:
388    unix
389
390Running target unix
391Using /tools/share/dejagnu/baseboards/unix.exp as board description file for target.
392Using /tools/share/dejagnu/config/unix.exp as generic interface file for target.
393Using /sources/gcc-5.1.0/libstdc++-v3/testsuite/config/default.exp as tool-and-target-specific interface file.
394Running /sources/gcc-5.1.0/libstdc++-v3/testsuite/libstdc++-abi/abi.exp ...
395Running /sources/gcc-5.1.0/libstdc++-v3/testsuite/libstdc++-dg/conformance.exp ...
396Running /sources/gcc-5.1.0/gcc/testsuite/gcc.dg/noncompile/noncompile.exp ...
397Running /sources/gcc-5.1.0/gcc/testsuite/gcc.dg/pch/pch.exp ...
398Running /sources/gcc-5.1.0/gcc/testsuite/gcc.dg/plugin/plugin.exp ...
399Running /sources/gcc-5.1.0/gcc/testsuite/gcc.dg/simulate-thread/simulate-thread.exp ...
400Running /sources/gcc-5.1.0/gcc/testsuite/gcc.dg/special/mips-abi.exp ...
401Running /sources/gcc-5.1.0/gcc/testsuite/gcc.dg/special/special.exp ...
402Running /sources/gcc-5.1.0/gcc/testsuite/gcc.dg/tls/tls.exp ...
403Running /sources/gcc-5.1.0/gcc/testsuite/gcc.dg/tm/tm.exp ...
404Running /sources/gcc-5.1.0/gcc/testsuite/gcc.dg/torture/dg-torture.exp ...
405Running /sources/gcc-5.1.0/libstdc++-v3/testsuite/libstdc++-prettyprinters/prettyprinters.exp ...
406Running /sources/gcc-5.1.0/libstdc++-v3/testsuite/libstdc++-prettyprinters/prettyprinters.exp ...
407Running /sources/gcc-5.1.0/libstdc++-v3/testsuite/libstdc++-xmethods/xmethods.exp ...
408Running /sources/gcc-5.1.0/libstdc++-v3/testsuite/libstdc++-xmethods/xmethods.exp ...
409
410                === libstdc++ Summary ===
411
412# of expected passes            711
413# of unsupported tests          6
414make[2]: Entering directory '/sources/gcc-build/x86_64-unknown-linux-gnu/libsanitizer'
415Making check in sanitizer_common
416make[3]: Entering directory '/sources/gcc-build/x86_64-unknown-linux-gnu/libsanitizer/sanitizer_common'
417make[3]: Nothing to be done for 'check'.
418make[3]: Leaving directory '/sources/gcc-build/x86_64-unknown-linux-gnu/libsanitizer/sanitizer_common'
419Making check in interception
420make[3]: Entering directory '/sources/gcc-build/x86_64-unknown-linux-gnu/libsanitizer/interception'
421make[3]: Nothing to be done for 'check'.
422make[3]: Leaving directory '/sources/gcc-build/x86_64-unknown-linux-gnu/libsanitizer/interception'
423Making check in libbacktrace
424make[3]: Entering directory '/sources/gcc-build/x86_64-unknown-linux-gnu/libsanitizer/libbacktrace'
425make[3]: Nothing to be done for 'check'.
426make[3]: Leaving directory '/sources/gcc-build/x86_64-unknown-linux-gnu/libsanitizer/libbacktrace'
427Making check in lsan
428make[3]: Entering directory '/sources/gcc-build/x86_64-unknown-linux-gnu/libsanitizer/lsan'
429make[3]: Nothing to be done for 'check'.
430make[3]: Leaving directory '/sources/gcc-build/x86_64-unknown-linux-gnu/libsanitizer/lsan'
431Making check in asan
432make[3]: Entering directory '/sources/gcc-build/x86_64-unknown-linux-gnu/libsanitizer/asan'
433make[3]: Nothing to be done for 'check'.
434make[3]: Leaving directory '/sources/gcc-build/x86_64-unknown-linux-gnu/libsanitizer/asan'
435Making check in ubsan
436make[3]: Entering directory '/sources/gcc-build/x86_64-unknown-linux-gnu/libsanitizer/ubsan'
437make[3]: Nothing to be done for 'check'.
438make[3]: Leaving directory '/sources/gcc-build/x86_64-unknown-linux-gnu/libsanitizer/ubsan'
439Making check in tsan
440make[3]: Entering directory '/sources/gcc-build/x86_64-unknown-linux-gnu/libsanitizer/tsan'
441make[3]: Nothing to be done for 'check'.
442make[3]: Leaving directory '/sources/gcc-build/x86_64-unknown-linux-gnu/libsanitizer/tsan'
443make[3]: Entering directory '/sources/gcc-build/x86_64-unknown-linux-gnu/libsanitizer'
444true "AR_FLAGS=rc" "CC_FOR_BUILD=gcc -isystem /usr/include" "CFLAGS=-g -O2 -O3 -march=native -mtune=native -pipe -fomit-frame-pointer -s" "CXXFLAGS=-g -O2 -O3 -march=native -mtune=native -pipe -fomit-frame-pointer -s -D_GNU_SOURCE" "CFLAGS_FOR_BUILD=-O3 -march=native -mtune=native -pipe -fomit-frame-pointer -s" "CFLAGS_FOR_TARGET=-g -O2 -O3 -march=native -mtune=native -pipe -fomit-frame-pointer -s" "INSTALL=/tools/bin/install -c" "INSTALL_DATA=/tools/bin/install -c -m 644" "INSTALL_PROGRAM=/tools/bin/install -c" "INSTALL_SCRIPT=/tools/bin/install -c" "JC1FLAGS=" "LDFLAGS=" "LIBCFLAGS=-g -O2 -O3 -march=native -mtune=native -pipe -fomit-frame-pointer -s" "LIBCFLAGS_FOR_TARGET=-g -O2 -O3 -march=native -mtune=native -pipe -fomit-frame-pointer -s" "MAKE=make" "MAKEINFO=makeinfo --split-size=5000000 --split-size=5000000  " "PICFLAG=" "PICFLAG_FOR_TARGET=" "SHELL=/bin/sh" "RUNTESTFLAGS=" "exec_prefix=/usr" "infodir=/usr/share/info" "libdir=/usr/lib" "prefix=/usr" "includedir=/usr/include" "AR=ar" "AS=/sources/gcc-build/./gcc/as" "LD=/sources/gcc-build/./gcc/collect-ld" "LIBCFLAGS=-g -O2 -O3 -march=native -mtune=native -pipe -fomit-frame-pointer -s" "NM=/sources/gcc-build/./gcc/nm" "PICFLAG=" "RANLIB=ranlib" "DESTDIR=" DO=all multi-do # make
445make[3]: Leaving directory '/sources/gcc-build/x86_64-unknown-linux-gnu/libsanitizer'
446make[2]: Leaving directory '/sources/gcc-build/x86_64-unknown-linux-gnu/libsanitizer'
447make[2]: Entering directory '/sources/gcc-build/x86_64-unknown-linux-gnu/libvtv'
448make  check-recursive
449make[3]: Entering directory '/sources/gcc-build/x86_64-unknown-linux-gnu/libvtv'
450make[4]: Entering directory '/sources/gcc-build/x86_64-unknown-linux-gnu/libvtv'
451true  DO=all multi-do # make
452make[4]: Leaving directory '/sources/gcc-build/x86_64-unknown-linux-gnu/libvtv'
453make[3]: Leaving directory '/sources/gcc-build/x86_64-unknown-linux-gnu/libvtv'
454make[2]: Leaving directory '/sources/gcc-build/x86_64-unknown-linux-gnu/libvtv'
455make[2]: Entering directory '/sources/gcc-build/x86_64-unknown-linux-gnu/libcilkrts'
456true "AR_FLAGS=rc" "CC_FOR_BUILD=gcc -isystem /usr/include" "CFLAGS=-g -O2 -O3 -march=native -mtune=native -pipe -fomit-frame-pointer -s" "CXXFLAGS=-g -O2 -O3 -march=native -mtune=native -pipe -fomit-frame-pointer -s -D_GNU_SOURCE" "CFLAGS_FOR_BUILD=-O3 -march=native -mtune=native -pipe -fomit-frame-pointer -s" "CFLAGS_FOR_TARGET=-g -O2 -O3 -march=native -mtune=native -pipe -fomit-frame-pointer -s" "INSTALL=/tools/bin/install -c" "INSTALL_DATA=/tools/bin/install -c -m 644" "INSTALL_PROGRAM=/tools/bin/install -c" "INSTALL_SCRIPT=/tools/bin/install -c" "JC1FLAGS=" "LDFLAGS=" "LIBCFLAGS=-g -O2 -O3 -march=native -mtune=native -pipe -fomit-frame-pointer -s" "LIBCFLAGS_FOR_TARGET=-g -O2 -O3 -march=native -mtune=native -pipe -fomit-frame-pointer -s" "MAKE=make" "MAKEINFO=makeinfo --split-size=5000000 --split-size=5000000 " "PICFLAG=" "PICFLAG_FOR_TARGET=" "SHELL=/bin/sh" "RUNTESTFLAGS=" "exec_prefix=/usr" "infodir=/usr/share/info" "libdir=/usr/lib" "prefix=/usr" "includedir=/usr/include" "AR=ar" "AS=/sources/gcc-build/./gcc/as" "LD=/sources/gcc-build/./gcc/collect-ld" "LIBCFLAGS=-g -O2 -O3 -march=native -mtune=native -pipe -fomit-frame-pointer -s" "NM=/sources/gcc-build/./gcc/nm" "PICFLAG=" "RANLIB=ranlib" "DESTDIR=" DO=all multi-do # make
457make[2]: Leaving directory '/sources/gcc-build/x86_64-unknown-linux-gnu/libcilkrts'
458make[2]: Entering directory '/sources/gcc-build/x86_64-unknown-linux-gnu/libssp'
459true "AR_FLAGS=rc" "CC_FOR_BUILD=gcc -isystem /usr/include" "CFLAGS=-g -O2 -O3 -march=native -mtune=native -pipe -fomit-frame-pointer -s" "CXXFLAGS=-g -O2 -O3 -march=native -mtune=native -pipe -fomit-frame-pointer -s -D_GNU_SOURCE" "CFLAGS_FOR_BUILD=-O3 -march=native -mtune=native -pipe -fomit-frame-pointer -s" "CFLAGS_FOR_TARGET=-g -O2 -O3 -march=native -mtune=native -pipe -fomit-frame-pointer -s" "INSTALL=/tools/bin/install -c" "INSTALL_DATA=/tools/bin/install -c -m 644" "INSTALL_PROGRAM=/tools/bin/install -c" "INSTALL_SCRIPT=/tools/bin/install -c" "JC1FLAGS=" "LDFLAGS=" "LIBCFLAGS=-g -O2 -O3 -march=native -mtune=native -pipe -fomit-frame-pointer -s" "LIBCFLAGS_FOR_TARGET=-g -O2 -O3 -march=native -mtune=native -pipe -fomit-frame-pointer -s" "MAKE=make" "MAKEINFO=makeinfo --split-size=5000000 --split-size=5000000 " "PICFLAG=" "PICFLAG_FOR_TARGET=" "SHELL=/bin/sh" "RUNTESTFLAGS=" "exec_prefix=/usr" "infodir=/usr/share/info" "libdir=/usr/lib" "prefix=/usr" "includedir=/usr/include" "AR=ar" "AS=/sources/gcc-build/./gcc/as" "CC=/sources/gcc-build/./gcc/xgcc -B/sources/gcc-build/./gcc/ -B/usr/x86_64-unknown-linux-gnu/bin/ -B/usr/x86_64-unknown-linux-gnu/lib/ -isystem /usr/x86_64-unknown-linux-gnu/include -isystem /usr/x86_64-unknown-linux-gnu/sys-include   " "CXX=/sources/gcc-build/./gcc/xg++ -B/sources/gcc-build/./gcc/ -nostdinc++ -nostdinc++ -I/sources/gcc-build/x86_64-unknown-linux-gnu/libstdc++-v3/include/x86_64-unknown-linux-gnu -I/sources/gcc-build/x86_64-unknown-linux-gnu/libstdc++-v3/include -I/sources/gcc-5.1.0/libstdc++-v3/libsupc++ -I/sources/gcc-5.1.0/libstdc++-v3/include/backward -I/sources/gcc-5.1.0/libstdc++-v3/testsuite/util -L/sources/gcc-build/x86_64-unknown-linux-gnu/libstdc++-v3/src -L/sources/gcc-build/x86_64-unknown-linux-gnu/libstdc++-v3/src/.libs -L/sources/gcc-build/x86_64-unknown-linux-gnu/libstdc++-v3/libsupc++/.libs -B/sources/gcc-build/x86_64-unknown-linux-gnu/libstdc++-v3/src/.libs -B/sources/gcc-build/x86_64-unknown-linux-gnu/libstdc++-v3/libsupc++/.libs -B/usr/x86_64-unknown-linux-gnu/bin/ -B/usr/x86_64-unknown-linux-gnu/lib/ -isystem /usr/x86_64-unknown-linux-gnu/include -isystem /usr/x86_64-unknown-linux-gnu/sys-include   " "LD=/sources/gcc-build/./gcc/collect-ld" "LIBCFLAGS=-g -O2 -O3 -march=native -mtune=native -pipe -fomit-frame-pointer -s" "NM=/sources/gcc-build/./gcc/nm" "PICFLAG=" "RANLIB=ranlib" "DESTDIR=" DO=all multi-do # make
460make[2]: Leaving directory '/sources/gcc-build/x86_64-unknown-linux-gnu/libssp'
461make[2]: Entering directory '/sources/gcc-build/x86_64-unknown-linux-gnu/libquadmath'
462true "AR_FLAGS=rc" "CC_FOR_BUILD=gcc -isystem /usr/include" "CFLAGS=-g -O2 -O3 -march=native -mtune=native -pipe -fomit-frame-pointer -s" "CXXFLAGS=-g -O2 -O3 -march=native -mtune=native -pipe -fomit-frame-pointer -s -D_GNU_SOURCE" "CFLAGS_FOR_BUILD=-O3 -march=native -mtune=native -pipe -fomit-frame-pointer -s" "CFLAGS_FOR_TARGET=-g -O2 -O3 -march=native -mtune=native -pipe -fomit-frame-pointer -s" "INSTALL=/tools/bin/install -c" "INSTALL_DATA=/tools/bin/install -c -m 644" "INSTALL_PROGRAM=/tools/bin/install -c" "INSTALL_SCRIPT=/tools/bin/install -c" "JC1FLAGS=" "LDFLAGS=" "LIBCFLAGS=-g -O2 -O3 -march=native -mtune=native -pipe -fomit-frame-pointer -s" "LIBCFLAGS_FOR_TARGET=-g -O2 -O3 -march=native -mtune=native -pipe -fomit-frame-pointer -s" "MAKE=make" "MAKEINFO=makeinfo --split-size=5000000 --split-size=5000000 -I ../../../gcc-5.1.0/libquadmath/../gcc/doc/include" "PICFLAG=" "PICFLAG_FOR_TARGET=" "SHELL=/bin/sh" "RUNTESTFLAGS=" "exec_prefix=/usr" "infodir=/usr/share/info" "libdir=/usr/lib" "prefix=/usr" "includedir=/usr/include" "AR=ar" "AS=/sources/gcc-build/./gcc/as" "CC=/sources/gcc-build/./gcc/xgcc -B/sources/gcc-build/./gcc/ -B/usr/x86_64-unknown-linux-gnu/bin/ -B/usr/x86_64-unknown-linux-gnu/lib/ -isystem /usr/x86_64-unknown-linux-gnu/include -isystem /usr/x86_64-unknown-linux-gnu/sys-include   " "CXX=/sources/gcc-build/./gcc/xg++ -B/sources/gcc-build/./gcc/ -nostdinc++ -nostdinc++ -I/sources/gcc-build/x86_64-unknown-linux-gnu/libstdc++-v3/include/x86_64-unknown-linux-gnu -I/sources/gcc-build/x86_64-unknown-linux-gnu/libstdc++-v3/include -I/sources/gcc-5.1.0/libstdc++-v3/libsupc++ -I/sources/gcc-5.1.0/libstdc++-v3/include/backward -I/sources/gcc-5.1.0/libstdc++-v3/testsuite/util -L/sources/gcc-build/x86_64-unknown-linux-gnu/libstdc++-v3/src -L/sources/gcc-build/x86_64-unknown-linux-gnu/libstdc++-v3/src/.libs -L/sources/gcc-build/x86_64-unknown-linux-gnu/libstdc++-v3/libsupc++/.libs -B/sources/gcc-build/x86_64-unknown-linux-gnu/libstdc++-v3/src/.libs -B/sources/gcc-build/x86_64-unknown-linux-gnu/libstdc++-v3/libsupc++/.libs -B/usr/x86_64-unknown-linux-gnu/bin/ -B/usr/x86_64-unknown-linux-gnu/lib/ -isystem /usr/x86_64-unknown-linux-gnu/include -isystem /usr/x86_64-unknown-linux-gnu/sys-include   " "LD=/sources/gcc-build/./gcc/collect-ld" "LIBCFLAGS=-g -O2 -O3 -march=native -mtune=native -pipe -fomit-frame-pointer -s" "NM=/sources/gcc-build/./gcc/nm" "PICFLAG=" "RANLIB=ranlib" "DESTDIR=" DO=all multi-do # make
463make[2]: Leaving directory '/sources/gcc-build/x86_64-unknown-linux-gnu/libquadmath'
464make[2]: Entering directory '/sources/gcc-build/x86_64-unknown-linux-gnu/libgomp'
465Making check in testsuite
466make[3]: Entering directory '/sources/gcc-build/x86_64-unknown-linux-gnu/libgomp/testsuite'
467make  check-DEJAGNU
468make[4]: Entering directory '/sources/gcc-build/x86_64-unknown-linux-gnu/libgomp/testsuite'
469Making a new site.exp file...
470srcdir=`CDPATH="${ZSH_VERSION+.}:" && cd ../../../../gcc-5.1.0/libgomp/testsuite && pwd`; export srcdir; \
471EXPECT=expect; export EXPECT; \
472runtest=runtest; \
473if /bin/sh -c "$runtest --version" > /dev/null 2>&1; then \
474  exit_status=0; l='libgomp'; for tool in $l; do \
475    if $runtest  --tool $tool --srcdir $srcdir ; \
476    then :; else exit_status=1; fi; \
477  done; \
478else echo "WARNING: could not find \`runtest'" 1>&2; :;\
479fi; \
480exit $exit_status
481WARNING: Couldn't find the global config file.
482Test Run By root on Tue May  5 03:45:45 2015
483Native configuration is x86_64-unknown-linux-gnu
484
485                === libgomp tests ===
486
487Schedule of variations:
488    unix
489
490Running target unix
491Using /tools/share/dejagnu/baseboards/unix.exp as board description file for target.
492Using /tools/share/dejagnu/config/unix.exp as generic interface file for target.
493Using /sources/gcc-5.1.0/libgomp/testsuite/config/default.exp as tool-and-target-specific interface file.
494Running /sources/gcc-5.1.0/libgomp/testsuite/libgomp.c/c.exp ...
495
496                === libstdc++ Summary ===
497
498# of expected passes            9613
499# of unexpected failures        7
500# of expected failures          65
501# of unresolved testcases       1
502# of unsupported tests          231
503make[5]: Leaving directory '/sources/gcc-build/x86_64-unknown-linux-gnu/libstdc++-v3/testsuite'
504make[4]: Leaving directory '/sources/gcc-build/x86_64-unknown-linux-gnu/libstdc++-v3/testsuite'
505make[3]: Leaving directory '/sources/gcc-build/x86_64-unknown-linux-gnu/libstdc++-v3/testsuite'
506Making check in python
507make[3]: Entering directory '/sources/gcc-build/x86_64-unknown-linux-gnu/libstdc++-v3/python'
508make[3]: Nothing to be done for 'check'.
509make[3]: Leaving directory '/sources/gcc-build/x86_64-unknown-linux-gnu/libstdc++-v3/python'
510make[3]: Entering directory '/sources/gcc-build/x86_64-unknown-linux-gnu/libstdc++-v3'
511true "AR_FLAGS=rc" "CC_FOR_BUILD=gcc -isystem /usr/include" "CC_FOR_TARGET=/sources/gcc-build/./gcc/xgcc -B/sources/gcc-build/./gcc/" "CFLAGS=-g -O2 -O3 -march=native -mtune=native -pipe -fomit-frame-pointer -s" "CXXFLAGS=-g -O2 -O3 -march=native -mtune=native -pipe -fomit-frame-pointer -s -D_GNU_SOURCE" "CFLAGS_FOR_BUILD=-O3 -march=native -mtune=native -pipe -fomit-frame-pointer -s" "CFLAGS_FOR_TARGET=-g -O2 -O3 -march=native -mtune=native -pipe -fomit-frame-pointer -s" "INSTALL=/tools/bin/install -c" "INSTALL_DATA=/tools/bin/install -c -m 644" "INSTALL_PROGRAM=/tools/bin/install -c" "INSTALL_SCRIPT=/tools/bin/install -c" "LDFLAGS=" "LIBCFLAGS=-g -O2 -O3 -march=native -mtune=native -pipe -fomit-frame-pointer -s" "LIBCFLAGS_FOR_TARGET=-g -O2 -O3 -march=native -mtune=native -pipe -fomit-frame-pointer -s" "MAKE=make" "MAKEINFO=makeinfo --split-size=5000000 --split-size=5000000  " "SHELL=/bin/sh" "RUNTESTFLAGS=" "exec_prefix=/usr" "infodir=/usr/share/info" "libdir=/usr/lib" "includedir=/usr/include" "prefix=/usr" "tooldir=/usr/x86_64-unknown-linux-gnu" "gxx_include_dir=/usr/include/c++/5.1.0" "AR=ar" "AS=/sources/gcc-build/./gcc/as" "LD=/sources/gcc-build/./gcc/collect-ld" "RANLIB=ranlib" "NM=/sources/gcc-build/./gcc/nm" "NM_FOR_BUILD=" "NM_FOR_TARGET=nm" "DESTDIR=" "WERROR=" DO=all multi-do # make
512make[3]: Leaving directory '/sources/gcc-build/x86_64-unknown-linux-gnu/libstdc++-v3'
513make[2]: Leaving directory '/sources/gcc-build/x86_64-unknown-linux-gnu/libstdc++-v3'
514make[2]: Entering directory '/sources/gcc-build/x86_64-unknown-linux-gnu/libitm'
515Making check in testsuite
516make[3]: Entering directory '/sources/gcc-build/x86_64-unknown-linux-gnu/libitm/testsuite'
517make  check-DEJAGNU
518make[4]: Entering directory '/sources/gcc-build/x86_64-unknown-linux-gnu/libitm/testsuite'
519Making a new site.exp file...
520srcdir=`CDPATH="${ZSH_VERSION+.}:" && cd ../../../../gcc-5.1.0/libitm/testsuite && pwd`; export srcdir; \
521EXPECT=expect; export EXPECT; \
522runtest=runtest; \
523if /bin/sh -c "$runtest --version" > /dev/null 2>&1; then \
524  exit_status=0; l='libitm'; for tool in $l; do \
525    if $runtest  --tool $tool --srcdir $srcdir ; \
526    then :; else exit_status=1; fi; \
527  done; \
528else echo "WARNING: could not find \`runtest'" 1>&2; :;\
529fi; \
530exit $exit_status
531WARNING: Couldn't find the global config file.
532Test Run By root on Tue May  5 03:45:56 2015
533Native configuration is x86_64-unknown-linux-gnu
534
535                === libitm tests ===
536
537Schedule of variations:
538    unix
539
540Running target unix
541Using /tools/share/dejagnu/baseboards/unix.exp as board description file for target.
542Using /tools/share/dejagnu/config/unix.exp as generic interface file for target.
543Using /sources/gcc-5.1.0/libitm/testsuite/config/default.exp as tool-and-target-specific interface file.
544Running /sources/gcc-5.1.0/libitm/testsuite/libitm.c/c.exp ...
545Running /sources/gcc-5.1.0/libitm/testsuite/libitm.c++/c++.exp ...
546
547                === libitm Summary ===
548
549# of expected passes            26
550# of expected failures          3
551# of unsupported tests          1
552make[4]: Leaving directory '/sources/gcc-build/x86_64-unknown-linux-gnu/libitm/testsuite'
553make[3]: Leaving directory '/sources/gcc-build/x86_64-unknown-linux-gnu/libitm/testsuite'
554make[3]: Entering directory '/sources/gcc-build/x86_64-unknown-linux-gnu/libitm'
555true  DO=all multi-do # make
556make[3]: Leaving directory '/sources/gcc-build/x86_64-unknown-linux-gnu/libitm'
557make[2]: Leaving directory '/sources/gcc-build/x86_64-unknown-linux-gnu/libitm'
558make[2]: Entering directory '/sources/gcc-build/x86_64-unknown-linux-gnu/libatomic'
559Making check in testsuite
560make[3]: Entering directory '/sources/gcc-build/x86_64-unknown-linux-gnu/libatomic/testsuite'
561make  check-DEJAGNU
562make[4]: Entering directory '/sources/gcc-build/x86_64-unknown-linux-gnu/libatomic/testsuite'
563Making a new site.exp file...
564srcdir='../../../../gcc-5.1.0/libatomic/testsuite'; export srcdir; \
565EXPECT=expect; export EXPECT; \
566runtest=runtest; \
567if /bin/sh -c "$runtest --version" > /dev/null 2>&1; then \
568  exit_status=0; l='libatomic'; for tool in $l; do \
569    if $runtest  --tool $tool --srcdir $srcdir ; \
570    then :; else exit_status=1; fi; \
571  done; \
572else echo "WARNING: could not find \`runtest'" 1>&2; :;\
573fi; \
574exit $exit_status
575WARNING: Couldn't find the global config file.
576Test Run By root on Tue May  5 03:46:00 2015
577Native configuration is x86_64-unknown-linux-gnu
578
579                === libatomic tests ===
580
581Schedule of variations:
582    unix
583
584Running target unix
585Using /tools/share/dejagnu/baseboards/unix.exp as board description file for target.
586Using /tools/share/dejagnu/config/unix.exp as generic interface file for target.
587Using ../../../../gcc-5.1.0/libatomic/testsuite/config/default.exp as tool-and-target-specific interface file.
588Running ../../../../gcc-5.1.0/libatomic/testsuite/libatomic.c/c.exp ...
589
590                === libatomic Summary ===
591
592# of expected passes            54
593make[4]: Leaving directory '/sources/gcc-build/x86_64-unknown-linux-gnu/libatomic/testsuite'
594make[3]: Leaving directory '/sources/gcc-build/x86_64-unknown-linux-gnu/libatomic/testsuite'
595make[3]: Entering directory '/sources/gcc-build/x86_64-unknown-linux-gnu/libatomic'
596true  DO=all multi-do # make
597make[3]: Leaving directory '/sources/gcc-build/x86_64-unknown-linux-gnu/libatomic'
598make[2]: Leaving directory '/sources/gcc-build/x86_64-unknown-linux-gnu/libatomic'
599WARNING: Couldn't find the global config file.
600Test Run By root on Tue May  5 03:46:04 2015
601Native configuration is x86_64-unknown-linux-gnu
602
603                === gcc tests ===
604
605Schedule of variations:
606    unix
607
608Running target unix
609Using /tools/share/dejagnu/baseboards/unix.exp as board description file for target.
610Using /tools/share/dejagnu/config/unix.exp as generic interface file for target.
611Using /sources/gcc-5.1.0/gcc/testsuite/config/default.exp as tool-and-target-specific interface file.
612Running /sources/gcc-5.1.0/gcc/testsuite/gcc.c-torture/compile/compile.exp ...
613Running /sources/gcc-5.1.0/gcc/testsuite/gcc.c-torture/execute/builtins/builtins.exp ...
614Running /sources/gcc-5.1.0/gcc/testsuite/gcc.c-torture/execute/execute.exp ...
615Running /sources/gcc-5.1.0/gcc/testsuite/gcc.c-torture/execute/ieee/ieee.exp ...
616Running /sources/gcc-5.1.0/gcc/testsuite/gcc.c-torture/unsorted/unsorted.exp ...
617Running /sources/gcc-5.1.0/gcc/testsuite/gcc.dg/asan/asan.exp ...
618Running /sources/gcc-5.1.0/gcc/testsuite/gcc.dg/atomic/atomic.exp ...
619Running /sources/gcc-5.1.0/gcc/testsuite/gcc.dg/autopar/autopar.exp ...
620Running /sources/gcc-5.1.0/gcc/testsuite/gcc.dg/charset/charset.exp ...
621Running /sources/gcc-5.1.0/gcc/testsuite/gcc.dg/cilk-plus/cilk-plus.exp ...
622Running /sources/gcc-5.1.0/gcc/testsuite/gcc.dg/compat/compat.exp ...
623Running /sources/gcc-5.1.0/gcc/testsuite/gcc.dg/compat/struct-layout-1.exp ...
624Running /sources/gcc-5.1.0/gcc/testsuite/gcc.dg/cpp/cpp.exp ...
625Running /sources/gcc-5.1.0/gcc/testsuite/gcc.dg/cpp/trad/trad.exp ...
626Running /sources/gcc-5.1.0/gcc/testsuite/gcc.dg/debug/debug.exp ...
627Running /sources/gcc-5.1.0/gcc/testsuite/gcc.dg/debug/dwarf2/dwarf2.exp ...
628Running /sources/gcc-5.1.0/gcc/testsuite/gcc.dg/dfp/dfp.exp ...
629Running /sources/gcc-5.1.0/gcc/testsuite/gcc.dg/dg.exp ...
630Running /sources/gcc-5.1.0/gcc/testsuite/gcc.dg/fixed-point/fixed-point.exp ...
631Running /sources/gcc-5.1.0/gcc/testsuite/gcc.dg/format/format.exp ...
632Running /sources/gcc-5.1.0/gcc/testsuite/gcc.dg/goacc-gomp/goacc-gomp.exp ...
633Running /sources/gcc-5.1.0/gcc/testsuite/gcc.dg/goacc/goacc.exp ...
634Running /sources/gcc-5.1.0/gcc/testsuite/gcc.dg/gomp/gomp.exp ...
635Running /sources/gcc-5.1.0/gcc/testsuite/gcc.dg/graphite/graphite.exp ...
636Running /sources/gcc-5.1.0/gcc/testsuite/gcc.dg/guality/guality.exp ...
637Running /sources/gcc-5.1.0/gcc/testsuite/gcc.dg/ipa/ipa.exp ...
638Running /sources/gcc-5.1.0/gcc/testsuite/gcc.dg/lto/lto.exp ...
639Running /sources/gcc-5.1.0/gcc/testsuite/gcc.dg/noncompile/noncompile.exp ...
640Running /sources/gcc-5.1.0/gcc/testsuite/gcc.dg/pch/pch.exp ...
641Running /sources/gcc-5.1.0/gcc/testsuite/gcc.dg/plugin/plugin.exp ...
642Running /sources/gcc-5.1.0/gcc/testsuite/gcc.dg/simulate-thread/simulate-thread.exp ...
643Running /sources/gcc-5.1.0/gcc/testsuite/gcc.dg/special/mips-abi.exp ...
644Running /sources/gcc-5.1.0/gcc/testsuite/gcc.dg/special/special.exp ...
645Running /sources/gcc-5.1.0/gcc/testsuite/gcc.dg/tls/tls.exp ...
646Running /sources/gcc-5.1.0/gcc/testsuite/gcc.dg/tm/tm.exp ...
647Running /sources/gcc-5.1.0/gcc/testsuite/gcc.dg/torture/dg-torture.exp ...
648Running /sources/gcc-5.1.0/libgomp/testsuite/libgomp.c++/c++.exp ...
649Running /sources/gcc-5.1.0/libgomp/testsuite/libgomp.fortran/fortran.exp ...
650No libgfortran library found, will not execute fortran tests
651Running /sources/gcc-5.1.0/libgomp/testsuite/libgomp.graphite/graphite.exp ...
652Running /sources/gcc-5.1.0/libgomp/testsuite/libgomp.oacc-c/c.exp ...
653FAIL: libgomp.oacc-c/../libgomp.oacc-c-c++-common/acc_on_device-1.c -DACC_DEVICE_TYPE_host_nonshm=1 -DACC_MEM_SHARED=0 execution test
654FAIL: libgomp.oacc-c/../libgomp.oacc-c-c++-common/if-1.c -DACC_DEVICE_TYPE_host_nonshm=1 -DACC_MEM_SHARED=0 execution test
655Running /sources/gcc-5.1.0/libgomp/testsuite/libgomp.oacc-c++/c++.exp ...
656FAIL: libgomp.oacc-c++/../libgomp.oacc-c-c++-common/acc_on_device-1.c -DACC_DEVICE_TYPE_host_nonshm=1 -DACC_MEM_SHARED=0 execution test
657FAIL: libgomp.oacc-c++/../libgomp.oacc-c-c++-common/if-1.c -DACC_DEVICE_TYPE_host_nonshm=1 -DACC_MEM_SHARED=0 execution test
658Running /sources/gcc-5.1.0/libgomp/testsuite/libgomp.oacc-fortran/fortran.exp ...
659No libgfortran library found, will not execute fortran tests
660
661                === libgomp Summary ===
662
663# of expected passes            1648
664# of unexpected failures        4
665# of unsupported tests          170
666Makefile:277: recipe for target 'check-DEJAGNU' failed
667make[4]: *** [check-DEJAGNU] Error 1
668make[4]: Leaving directory '/sources/gcc-build/x86_64-unknown-linux-gnu/libgomp/testsuite'
669Makefile:314: recipe for target 'check-am' failed
670make[3]: *** [check-am] Error 2
671make[3]: Target 'check' not remade because of errors.
672make[3]: Leaving directory '/sources/gcc-build/x86_64-unknown-linux-gnu/libgomp/testsuite'
673make[3]: Entering directory '/sources/gcc-build/x86_64-unknown-linux-gnu/libgomp'
674true  DO=all multi-do # make
675make[3]: Leaving directory '/sources/gcc-build/x86_64-unknown-linux-gnu/libgomp'
676Makefile:857: recipe for target 'check-recursive' failed
677make[2]: *** [check-recursive] Error 1
678make[2]: Target 'check' not remade because of errors.
679make[2]: Leaving directory '/sources/gcc-build/x86_64-unknown-linux-gnu/libgomp'
680Makefile:18313: recipe for target 'check-target-libgomp' failed
681make[1]: *** [check-target-libgomp] Error 2
682make[1]: Target 'check-target' not remade because of errors.
683WARNING: Couldn't find the global config file.
684Test Run By root on Tue May  5 03:49:46 2015
685Native configuration is x86_64-unknown-linux-gnu
686
687                === gcc tests ===
688
689Schedule of variations:
690    unix
691
692Running target unix
693Using /tools/share/dejagnu/baseboards/unix.exp as board description file for target.
694Using /tools/share/dejagnu/config/unix.exp as generic interface file for target.
695Using /sources/gcc-5.1.0/gcc/testsuite/config/default.exp as tool-and-target-specific interface file.
696Running /sources/gcc-5.1.0/gcc/testsuite/gcc.c-torture/compile/compile.exp ...
697Running /sources/gcc-5.1.0/gcc/testsuite/gcc.c-torture/execute/builtins/builtins.exp ...
698Running /sources/gcc-5.1.0/gcc/testsuite/gcc.c-torture/execute/execute.exp ...
699Running /sources/gcc-5.1.0/gcc/testsuite/gcc.c-torture/execute/ieee/ieee.exp ...
700Running /sources/gcc-5.1.0/gcc/testsuite/gcc.c-torture/unsorted/unsorted.exp ...
701Running /sources/gcc-5.1.0/gcc/testsuite/gcc.dg/asan/asan.exp ...
702Running /sources/gcc-5.1.0/gcc/testsuite/gcc.dg/atomic/atomic.exp ...
703Running /sources/gcc-5.1.0/gcc/testsuite/gcc.dg/autopar/autopar.exp ...
704Running /sources/gcc-5.1.0/gcc/testsuite/gcc.dg/charset/charset.exp ...
705Running /sources/gcc-5.1.0/gcc/testsuite/gcc.dg/cilk-plus/cilk-plus.exp ...
706Running /sources/gcc-5.1.0/gcc/testsuite/gcc.dg/compat/compat.exp ...
707Running /sources/gcc-5.1.0/gcc/testsuite/gcc.dg/compat/struct-layout-1.exp ...
708Running /sources/gcc-5.1.0/gcc/testsuite/gcc.dg/cpp/cpp.exp ...
709Running /sources/gcc-5.1.0/gcc/testsuite/gcc.dg/cpp/trad/trad.exp ...
710Running /sources/gcc-5.1.0/gcc/testsuite/gcc.dg/debug/debug.exp ...
711Running /sources/gcc-5.1.0/gcc/testsuite/gcc.dg/debug/dwarf2/dwarf2.exp ...
712Running /sources/gcc-5.1.0/gcc/testsuite/gcc.dg/dfp/dfp.exp ...
713Running /sources/gcc-5.1.0/gcc/testsuite/gcc.dg/dg.exp ...
714Running /sources/gcc-5.1.0/gcc/testsuite/gcc.dg/fixed-point/fixed-point.exp ...
715Running /sources/gcc-5.1.0/gcc/testsuite/gcc.dg/format/format.exp ...
716Running /sources/gcc-5.1.0/gcc/testsuite/gcc.dg/goacc-gomp/goacc-gomp.exp ...
717Running /sources/gcc-5.1.0/gcc/testsuite/gcc.dg/goacc/goacc.exp ...
718Running /sources/gcc-5.1.0/gcc/testsuite/gcc.dg/gomp/gomp.exp ...
719Running /sources/gcc-5.1.0/gcc/testsuite/gcc.dg/graphite/graphite.exp ...
720Running /sources/gcc-5.1.0/gcc/testsuite/gcc.dg/guality/guality.exp ...
721Running /sources/gcc-5.1.0/gcc/testsuite/gcc.dg/ipa/ipa.exp ...
722Running /sources/gcc-5.1.0/gcc/testsuite/gcc.dg/lto/lto.exp ...
723Running /sources/gcc-5.1.0/gcc/testsuite/gcc.dg/noncompile/noncompile.exp ...
724Running /sources/gcc-5.1.0/gcc/testsuite/gcc.dg/pch/pch.exp ...
725Running /sources/gcc-5.1.0/gcc/testsuite/gcc.dg/plugin/plugin.exp ...
726Running /sources/gcc-5.1.0/gcc/testsuite/gcc.dg/simulate-thread/simulate-thread.exp ...
727Running /sources/gcc-5.1.0/gcc/testsuite/gcc.dg/special/mips-abi.exp ...
728Running /sources/gcc-5.1.0/gcc/testsuite/gcc.dg/special/special.exp ...
729Running /sources/gcc-5.1.0/gcc/testsuite/gcc.dg/tls/tls.exp ...
730Running /sources/gcc-5.1.0/gcc/testsuite/gcc.dg/tm/tm.exp ...
731Running /sources/gcc-5.1.0/gcc/testsuite/gcc.dg/torture/dg-torture.exp ...
732Running /sources/gcc-5.1.0/gcc/testsuite/gcc.dg/torture/stackalign/stackalign.exp ...
733Running /sources/gcc-5.1.0/gcc/testsuite/gcc.dg/torture/stackalign/stackalign.exp ...
734Running /sources/gcc-5.1.0/gcc/testsuite/gcc.dg/torture/stackalign/stackalign.exp ...
735Running /sources/gcc-5.1.0/gcc/testsuite/gcc.dg/torture/tls/tls.exp ...
736Running /sources/gcc-5.1.0/gcc/testsuite/gcc.dg/torture/tls/tls.exp ...
737Running /sources/gcc-5.1.0/gcc/testsuite/gcc.dg/tree-prof/tree-prof.exp ...
738Running /sources/gcc-5.1.0/gcc/testsuite/gcc.dg/tree-ssa/tree-ssa.exp ...
739Running /sources/gcc-5.1.0/gcc/testsuite/gcc.dg/torture/tls/tls.exp ...
740Running /sources/gcc-5.1.0/gcc/testsuite/gcc.dg/tree-prof/tree-prof.exp ...
741Running /sources/gcc-5.1.0/gcc/testsuite/gcc.dg/tree-ssa/tree-ssa.exp ...
742Running /sources/gcc-5.1.0/gcc/testsuite/gcc.dg/tree-prof/tree-prof.exp ...
743Running /sources/gcc-5.1.0/gcc/testsuite/gcc.dg/tree-ssa/tree-ssa.exp ...
744Running /sources/gcc-5.1.0/gcc/testsuite/gcc.dg/tsan/tsan.exp ...
745Running /sources/gcc-5.1.0/gcc/testsuite/gcc.dg/tsan/tsan.exp ...
746Running /sources/gcc-5.1.0/gcc/testsuite/gcc.dg/tsan/tsan.exp ...
747Running /sources/gcc-5.1.0/gcc/testsuite/gcc.dg/ubsan/ubsan.exp ...
748Running /sources/gcc-5.1.0/gcc/testsuite/gcc.dg/ubsan/ubsan.exp ...
749Running /sources/gcc-5.1.0/gcc/testsuite/gcc.dg/ubsan/ubsan.exp ...
750Running /sources/gcc-5.1.0/gcc/testsuite/gcc.dg/vect/costmodel/i386/i386-costmodel-vect.exp ...
751Running /sources/gcc-5.1.0/gcc/testsuite/gcc.dg/vect/costmodel/ppc/ppc-costmodel-vect.exp ...
752Running /sources/gcc-5.1.0/gcc/testsuite/gcc.dg/vect/costmodel/spu/spu-costmodel-vect.exp ...
753Running /sources/gcc-5.1.0/gcc/testsuite/gcc.dg/vect/costmodel/x86_64/x86_64-costmodel-vect.exp ...
754Running /sources/gcc-5.1.0/gcc/testsuite/gcc.dg/vect/costmodel/i386/i386-costmodel-vect.exp ...
755Running /sources/gcc-5.1.0/gcc/testsuite/gcc.dg/vect/costmodel/ppc/ppc-costmodel-vect.exp ...
756Running /sources/gcc-5.1.0/gcc/testsuite/gcc.dg/vect/costmodel/spu/spu-costmodel-vect.exp ...
757Running /sources/gcc-5.1.0/gcc/testsuite/gcc.dg/vect/costmodel/x86_64/x86_64-costmodel-vect.exp ...
758Running /sources/gcc-5.1.0/gcc/testsuite/gcc.dg/vect/vect.exp ...
759Running /sources/gcc-5.1.0/gcc/testsuite/gcc.dg/vect/vect.exp ...
760Running /sources/gcc-5.1.0/gcc/testsuite/gcc.dg/vect/costmodel/i386/i386-costmodel-vect.exp ...
761Running /sources/gcc-5.1.0/gcc/testsuite/gcc.dg/vect/costmodel/ppc/ppc-costmodel-vect.exp ...
762Running /sources/gcc-5.1.0/gcc/testsuite/gcc.dg/vect/costmodel/spu/spu-costmodel-vect.exp ...
763Running /sources/gcc-5.1.0/gcc/testsuite/gcc.dg/vect/costmodel/x86_64/x86_64-costmodel-vect.exp ...
764Running /sources/gcc-5.1.0/gcc/testsuite/gcc.dg/vect/vect.exp ...
765Running /sources/gcc-5.1.0/gcc/testsuite/gcc.dg/vmx/vmx.exp ...
766Running /sources/gcc-5.1.0/gcc/testsuite/gcc.dg/vxworks/vxworks.exp ...
767Running /sources/gcc-5.1.0/gcc/testsuite/gcc.dg/weak/weak.exp ...
768Running /sources/gcc-5.1.0/gcc/testsuite/gcc.dg/vmx/vmx.exp ...
769Running /sources/gcc-5.1.0/gcc/testsuite/gcc.dg/vxworks/vxworks.exp ...
770Running /sources/gcc-5.1.0/gcc/testsuite/gcc.dg/weak/weak.exp ...
771Running /sources/gcc-5.1.0/gcc/testsuite/gcc.dg/vmx/vmx.exp ...
772Running /sources/gcc-5.1.0/gcc/testsuite/gcc.dg/vxworks/vxworks.exp ...
773Running /sources/gcc-5.1.0/gcc/testsuite/gcc.dg/weak/weak.exp ...
774Running /sources/gcc-5.1.0/gcc/testsuite/gcc.misc-tests/acker1.exp ...
775Running /sources/gcc-5.1.0/gcc/testsuite/gcc.misc-tests/arm-isr.exp ...
776Running /sources/gcc-5.1.0/gcc/testsuite/gcc.misc-tests/bprob.exp ...
777Running /sources/gcc-5.1.0/gcc/testsuite/gcc.misc-tests/acker1.exp ...
778Running /sources/gcc-5.1.0/gcc/testsuite/gcc.misc-tests/arm-isr.exp ...
779Running /sources/gcc-5.1.0/gcc/testsuite/gcc.misc-tests/bprob.exp ...
780Running /sources/gcc-5.1.0/gcc/testsuite/gcc.misc-tests/dectest.exp ...
781Running /sources/gcc-5.1.0/gcc/testsuite/gcc.misc-tests/dhry.exp ...
782Running /sources/gcc-5.1.0/gcc/testsuite/gcc.misc-tests/gcov.exp ...
783Running /sources/gcc-5.1.0/gcc/testsuite/gcc.misc-tests/acker1.exp ...
784Running /sources/gcc-5.1.0/gcc/testsuite/gcc.misc-tests/arm-isr.exp ...
785Running /sources/gcc-5.1.0/gcc/testsuite/gcc.misc-tests/bprob.exp ...
786Running /sources/gcc-5.1.0/gcc/testsuite/gcc.misc-tests/dectest.exp ...
787Running /sources/gcc-5.1.0/gcc/testsuite/gcc.misc-tests/dhry.exp ...
788Running /sources/gcc-5.1.0/gcc/testsuite/gcc.misc-tests/gcov.exp ...
789Running /sources/gcc-5.1.0/gcc/testsuite/gcc.misc-tests/godump.exp ...
790Running /sources/gcc-5.1.0/gcc/testsuite/gcc.misc-tests/help.exp ...
791Running /sources/gcc-5.1.0/gcc/testsuite/gcc.misc-tests/dectest.exp ...
792Running /sources/gcc-5.1.0/gcc/testsuite/gcc.misc-tests/dhry.exp ...
793Running /sources/gcc-5.1.0/gcc/testsuite/gcc.misc-tests/gcov.exp ...
794Running /sources/gcc-5.1.0/gcc/testsuite/gcc.misc-tests/godump.exp ...
795Running /sources/gcc-5.1.0/gcc/testsuite/gcc.misc-tests/help.exp ...
796Running /sources/gcc-5.1.0/gcc/testsuite/gcc.misc-tests/i386-prefetch.exp ...
797Running /sources/gcc-5.1.0/gcc/testsuite/gcc.misc-tests/linkage.exp ...
798Running /sources/gcc-5.1.0/gcc/testsuite/gcc.misc-tests/matrix1.exp ...
799Running /sources/gcc-5.1.0/gcc/testsuite/gcc.misc-tests/mg-2.exp ...
800Running /sources/gcc-5.1.0/gcc/testsuite/gcc.misc-tests/mg.exp ...
801Running /sources/gcc-5.1.0/gcc/testsuite/gcc.misc-tests/options.exp ...
802Running /sources/gcc-5.1.0/gcc/testsuite/gcc.misc-tests/i386-prefetch.exp ...
803Running /sources/gcc-5.1.0/gcc/testsuite/gcc.misc-tests/output.exp ...
804Running /sources/gcc-5.1.0/gcc/testsuite/gcc.misc-tests/linkage.exp ...
805Running /sources/gcc-5.1.0/gcc/testsuite/gcc.misc-tests/sieve.exp ...
806Running /sources/gcc-5.1.0/gcc/testsuite/gcc.misc-tests/sort2.exp ...
807Running /sources/gcc-5.1.0/gcc/testsuite/gcc.misc-tests/matrix1.exp ...
808Running /sources/gcc-5.1.0/gcc/testsuite/gcc.misc-tests/mg-2.exp ...
809Running /sources/gcc-5.1.0/gcc/testsuite/gcc.target/aarch64/aapcs64/aapcs64.exp ...
810Running /sources/gcc-5.1.0/gcc/testsuite/gcc.misc-tests/mg.exp ...
811Running /sources/gcc-5.1.0/gcc/testsuite/gcc.misc-tests/options.exp ...
812Running /sources/gcc-5.1.0/gcc/testsuite/gcc.misc-tests/output.exp ...
813Running /sources/gcc-5.1.0/gcc/testsuite/gcc.misc-tests/sieve.exp ...
814Running /sources/gcc-5.1.0/gcc/testsuite/gcc.misc-tests/sort2.exp ...
815Running /sources/gcc-5.1.0/gcc/testsuite/gcc.target/aarch64/aarch64.exp ...
816Running /sources/gcc-5.1.0/gcc/testsuite/gcc.target/aarch64/acle/acle.exp ...
817Running /sources/gcc-5.1.0/gcc/testsuite/gcc.target/aarch64/advsimd-intrinsics/advsimd-intrinsics.exp ...
818Running /sources/gcc-5.1.0/gcc/testsuite/gcc.target/aarch64/simd/simd.exp ...
819Running /sources/gcc-5.1.0/gcc/testsuite/gcc.target/alpha/alpha.exp ...
820Running /sources/gcc-5.1.0/gcc/testsuite/gcc.target/arc/arc.exp ...
821Running /sources/gcc-5.1.0/gcc/testsuite/gcc.target/arm/aapcs/aapcs.exp ...
822Running /sources/gcc-5.1.0/gcc/testsuite/gcc.misc-tests/godump.exp ...
823Running /sources/gcc-5.1.0/gcc/testsuite/gcc.misc-tests/help.exp ...
824Running /sources/gcc-5.1.0/gcc/testsuite/gcc.misc-tests/i386-prefetch.exp ...
825Running /sources/gcc-5.1.0/gcc/testsuite/gcc.misc-tests/linkage.exp ...
826Running /sources/gcc-5.1.0/gcc/testsuite/gcc.misc-tests/matrix1.exp ...
827Running /sources/gcc-5.1.0/gcc/testsuite/gcc.misc-tests/mg-2.exp ...
828Running /sources/gcc-5.1.0/gcc/testsuite/gcc.misc-tests/mg.exp ...
829Running /sources/gcc-5.1.0/gcc/testsuite/gcc.misc-tests/options.exp ...
830Running /sources/gcc-5.1.0/gcc/testsuite/gcc.misc-tests/output.exp ...
831Running /sources/gcc-5.1.0/gcc/testsuite/gcc.misc-tests/sieve.exp ...
832Running /sources/gcc-5.1.0/gcc/testsuite/gcc.misc-tests/sort2.exp ...
833Running /sources/gcc-5.1.0/gcc/testsuite/gcc.target/arm/acle/acle.exp ...
834Running /sources/gcc-5.1.0/gcc/testsuite/gcc.target/arm/arm.exp ...
835Running /sources/gcc-5.1.0/gcc/testsuite/gcc.target/arm/lto/lto.exp ...
836Running /sources/gcc-5.1.0/gcc/testsuite/gcc.target/arm/neon/neon.exp ...
837Running /sources/gcc-5.1.0/gcc/testsuite/gcc.target/arm/simd/simd.exp ...
838Running /sources/gcc-5.1.0/gcc/testsuite/gcc.target/avr/avr.exp ...
839Running /sources/gcc-5.1.0/gcc/testsuite/gcc.target/avr/torture/avr-torture.exp ...
840Running /sources/gcc-5.1.0/gcc/testsuite/gcc.target/bfin/bfin.exp ...
841Running /sources/gcc-5.1.0/gcc/testsuite/gcc.target/bfin/builtins/bfin-builtins.exp ...
842Running /sources/gcc-5.1.0/gcc/testsuite/gcc.target/cris/cris.exp ...
843Running /sources/gcc-5.1.0/gcc/testsuite/gcc.target/cris/torture/cris-torture.exp ...
844Running /sources/gcc-5.1.0/gcc/testsuite/gcc.target/epiphany/epiphany.exp ...
845Running /sources/gcc-5.1.0/gcc/testsuite/gcc.target/aarch64/aapcs64/aapcs64.exp ...
846Running /sources/gcc-5.1.0/gcc/testsuite/gcc.target/aarch64/aarch64.exp ...
847Running /sources/gcc-5.1.0/gcc/testsuite/gcc.target/aarch64/acle/acle.exp ...
848Running /sources/gcc-5.1.0/gcc/testsuite/gcc.target/aarch64/advsimd-intrinsics/advsimd-intrinsics.exp ...
849Running /sources/gcc-5.1.0/gcc/testsuite/gcc.target/aarch64/simd/simd.exp ...
850Running /sources/gcc-5.1.0/gcc/testsuite/gcc.target/alpha/alpha.exp ...
851Running /sources/gcc-5.1.0/gcc/testsuite/gcc.target/arc/arc.exp ...
852Running /sources/gcc-5.1.0/gcc/testsuite/gcc.target/frv/frv.exp ...
853Running /sources/gcc-5.1.0/gcc/testsuite/gcc.target/arm/aapcs/aapcs.exp ...
854Running /sources/gcc-5.1.0/gcc/testsuite/gcc.target/h8300/h8300.exp ...
855Running /sources/gcc-5.1.0/gcc/testsuite/gcc.target/i386/i386.exp ...
856Running /sources/gcc-5.1.0/gcc/testsuite/gcc.target/arm/acle/acle.exp ...
857Running /sources/gcc-5.1.0/gcc/testsuite/gcc.target/arm/arm.exp ...
858Running /sources/gcc-5.1.0/gcc/testsuite/gcc.target/arm/lto/lto.exp ...
859Running /sources/gcc-5.1.0/gcc/testsuite/gcc.target/arm/neon/neon.exp ...
860Running /sources/gcc-5.1.0/gcc/testsuite/gcc.target/arm/simd/simd.exp ...
861Running /sources/gcc-5.1.0/gcc/testsuite/gcc.target/avr/avr.exp ...
862Running /sources/gcc-5.1.0/gcc/testsuite/gcc.target/avr/torture/avr-torture.exp ...
863Running /sources/gcc-5.1.0/gcc/testsuite/gcc.target/bfin/bfin.exp ...
864Running /sources/gcc-5.1.0/gcc/testsuite/gcc.target/bfin/builtins/bfin-builtins.exp ...
865Running /sources/gcc-5.1.0/gcc/testsuite/gcc.target/cris/cris.exp ...
866Running /sources/gcc-5.1.0/gcc/testsuite/gcc.target/cris/torture/cris-torture.exp ...
867Running /sources/gcc-5.1.0/gcc/testsuite/gcc.target/epiphany/epiphany.exp ...
868Running /sources/gcc-5.1.0/gcc/testsuite/gcc.target/frv/frv.exp ...
869Running /sources/gcc-5.1.0/gcc/testsuite/gcc.target/h8300/h8300.exp ...
870Running /sources/gcc-5.1.0/gcc/testsuite/gcc.target/i386/i386.exp ...
871Running /sources/gcc-5.1.0/gcc/testsuite/gcc.target/aarch64/aapcs64/aapcs64.exp ...
872Running /sources/gcc-5.1.0/gcc/testsuite/gcc.target/aarch64/aarch64.exp ...
873Running /sources/gcc-5.1.0/gcc/testsuite/gcc.target/aarch64/acle/acle.exp ...
874Running /sources/gcc-5.1.0/gcc/testsuite/gcc.target/aarch64/advsimd-intrinsics/advsimd-intrinsics.exp ...
875Running /sources/gcc-5.1.0/gcc/testsuite/gcc.target/aarch64/simd/simd.exp ...
876Running /sources/gcc-5.1.0/gcc/testsuite/gcc.target/alpha/alpha.exp ...
877Running /sources/gcc-5.1.0/gcc/testsuite/gcc.target/arc/arc.exp ...
878Running /sources/gcc-5.1.0/gcc/testsuite/gcc.target/arm/aapcs/aapcs.exp ...
879Running /sources/gcc-5.1.0/gcc/testsuite/gcc.target/arm/acle/acle.exp ...
880Running /sources/gcc-5.1.0/gcc/testsuite/gcc.target/arm/arm.exp ...
881Running /sources/gcc-5.1.0/gcc/testsuite/gcc.target/arm/lto/lto.exp ...
882Running /sources/gcc-5.1.0/gcc/testsuite/gcc.target/arm/neon/neon.exp ...
883Running /sources/gcc-5.1.0/gcc/testsuite/gcc.target/arm/simd/simd.exp ...
884Running /sources/gcc-5.1.0/gcc/testsuite/gcc.target/avr/avr.exp ...
885Running /sources/gcc-5.1.0/gcc/testsuite/gcc.target/avr/torture/avr-torture.exp ...
886Running /sources/gcc-5.1.0/gcc/testsuite/gcc.target/bfin/bfin.exp ...
887Running /sources/gcc-5.1.0/gcc/testsuite/gcc.target/bfin/builtins/bfin-builtins.exp ...
888Running /sources/gcc-5.1.0/gcc/testsuite/gcc.target/cris/cris.exp ...
889Running /sources/gcc-5.1.0/gcc/testsuite/gcc.target/cris/torture/cris-torture.exp ...
890Running /sources/gcc-5.1.0/gcc/testsuite/gcc.target/epiphany/epiphany.exp ...
891Running /sources/gcc-5.1.0/gcc/testsuite/gcc.target/frv/frv.exp ...
892Running /sources/gcc-5.1.0/gcc/testsuite/gcc.target/h8300/h8300.exp ...
893Running /sources/gcc-5.1.0/gcc/testsuite/gcc.target/i386/i386.exp ...
894Running /sources/gcc-5.1.0/gcc/testsuite/gcc.target/i386/math-torture/math-torture.exp ...
895Running /sources/gcc-5.1.0/gcc/testsuite/gcc.target/i386/math-torture/math-torture.exp ...
896Running /sources/gcc-5.1.0/gcc/testsuite/gcc.target/i386/mpx/mpx.exp ...
897Running /sources/gcc-5.1.0/gcc/testsuite/gcc.target/i386/stackalign/stackalign.exp ...
898Running /sources/gcc-5.1.0/gcc/testsuite/gcc.target/ia64/ia64.exp ...
899Running /sources/gcc-5.1.0/gcc/testsuite/gcc.target/m68k/m68k.exp ...
900Running /sources/gcc-5.1.0/gcc/testsuite/gcc.target/microblaze/microblaze.exp ...
901Running /sources/gcc-5.1.0/gcc/testsuite/gcc.target/mips/inter/mips16-inter.exp ...
902Running /sources/gcc-5.1.0/gcc/testsuite/gcc.target/mips/mips-nonpic/mips-nonpic.exp ...
903Running /sources/gcc-5.1.0/gcc/testsuite/gcc.target/mips/mips.exp ...
904Running /sources/gcc-5.1.0/gcc/testsuite/gcc.target/nds32/nds32.exp ...
905Running /sources/gcc-5.1.0/gcc/testsuite/gcc.target/nios2/nios2.exp ...
906Running /sources/gcc-5.1.0/gcc/testsuite/gcc.target/powerpc/powerpc.exp ...
907Running /sources/gcc-5.1.0/gcc/testsuite/gcc.target/rx/rx.exp ...
908Running /sources/gcc-5.1.0/gcc/testsuite/gcc.target/s390/s390.exp ...
909Running /sources/gcc-5.1.0/gcc/testsuite/gcc.target/sh/sh.exp ...
910Running /sources/gcc-5.1.0/gcc/testsuite/gcc.target/sh/torture/sh-torture.exp ...
911Running /sources/gcc-5.1.0/gcc/testsuite/gcc.target/sparc/sparc.exp ...
912Running /sources/gcc-5.1.0/gcc/testsuite/gcc.target/spu/ea/ea.exp ...
913Running /sources/gcc-5.1.0/gcc/testsuite/gcc.target/spu/spu.exp ...
914Running /sources/gcc-5.1.0/gcc/testsuite/gcc.target/tic6x/builtins/c6x-builtins.exp ...
915Running /sources/gcc-5.1.0/gcc/testsuite/gcc.target/tic6x/tic6x.exp ...
916Running /sources/gcc-5.1.0/gcc/testsuite/gcc.target/vax/vax.exp ...
917Running /sources/gcc-5.1.0/gcc/testsuite/gcc.target/visium/visium.exp ...
918Running /sources/gcc-5.1.0/gcc/testsuite/gcc.target/x86_64/abi/abi-x86_64.exp ...
919Running /sources/gcc-5.1.0/gcc/testsuite/gcc.target/i386/mpx/mpx.exp ...
920Running /sources/gcc-5.1.0/gcc/testsuite/gcc.target/i386/stackalign/stackalign.exp ...
921Running /sources/gcc-5.1.0/gcc/testsuite/gcc.target/ia64/ia64.exp ...
922Running /sources/gcc-5.1.0/gcc/testsuite/gcc.target/m68k/m68k.exp ...
923Running /sources/gcc-5.1.0/gcc/testsuite/gcc.target/microblaze/microblaze.exp ...
924Running /sources/gcc-5.1.0/gcc/testsuite/gcc.target/mips/inter/mips16-inter.exp ...
925Running /sources/gcc-5.1.0/gcc/testsuite/gcc.target/mips/mips-nonpic/mips-nonpic.exp ...
926Running /sources/gcc-5.1.0/gcc/testsuite/gcc.target/mips/mips.exp ...
927Running /sources/gcc-5.1.0/gcc/testsuite/gcc.target/nds32/nds32.exp ...
928Running /sources/gcc-5.1.0/gcc/testsuite/gcc.target/nios2/nios2.exp ...
929Running /sources/gcc-5.1.0/gcc/testsuite/gcc.target/powerpc/powerpc.exp ...
930Running /sources/gcc-5.1.0/gcc/testsuite/gcc.target/rx/rx.exp ...
931Running /sources/gcc-5.1.0/gcc/testsuite/gcc.target/s390/s390.exp ...
932Running /sources/gcc-5.1.0/gcc/testsuite/gcc.target/sh/sh.exp ...
933Running /sources/gcc-5.1.0/gcc/testsuite/gcc.target/sh/torture/sh-torture.exp ...
934Running /sources/gcc-5.1.0/gcc/testsuite/gcc.target/sparc/sparc.exp ...
935Running /sources/gcc-5.1.0/gcc/testsuite/gcc.target/spu/ea/ea.exp ...
936Running /sources/gcc-5.1.0/gcc/testsuite/gcc.target/spu/spu.exp ...
937Running /sources/gcc-5.1.0/gcc/testsuite/gcc.target/tic6x/builtins/c6x-builtins.exp ...
938Running /sources/gcc-5.1.0/gcc/testsuite/gcc.target/tic6x/tic6x.exp ...
939Running /sources/gcc-5.1.0/gcc/testsuite/gcc.target/vax/vax.exp ...
940Running /sources/gcc-5.1.0/gcc/testsuite/gcc.target/visium/visium.exp ...
941Running /sources/gcc-5.1.0/gcc/testsuite/gcc.target/x86_64/abi/abi-x86_64.exp ...
942Running /sources/gcc-5.1.0/gcc/testsuite/gcc.target/x86_64/abi/avx/abi-avx.exp ...
943Running /sources/gcc-5.1.0/gcc/testsuite/gcc.target/x86_64/abi/avx512f/abi-avx512f.exp ...
944Running /sources/gcc-5.1.0/gcc/testsuite/gcc.target/i386/math-torture/math-torture.exp ...
945Running /sources/gcc-5.1.0/gcc/testsuite/gcc.target/i386/mpx/mpx.exp ...
946Running /sources/gcc-5.1.0/gcc/testsuite/gcc.target/i386/stackalign/stackalign.exp ...
947Running /sources/gcc-5.1.0/gcc/testsuite/gcc.target/ia64/ia64.exp ...
948Running /sources/gcc-5.1.0/gcc/testsuite/gcc.target/m68k/m68k.exp ...
949Running /sources/gcc-5.1.0/gcc/testsuite/gcc.target/microblaze/microblaze.exp ...
950Running /sources/gcc-5.1.0/gcc/testsuite/gcc.target/mips/inter/mips16-inter.exp ...
951Running /sources/gcc-5.1.0/gcc/testsuite/gcc.target/mips/mips-nonpic/mips-nonpic.exp ...
952Running /sources/gcc-5.1.0/gcc/testsuite/gcc.target/mips/mips.exp ...
953Running /sources/gcc-5.1.0/gcc/testsuite/gcc.target/nds32/nds32.exp ...
954Running /sources/gcc-5.1.0/gcc/testsuite/gcc.target/nios2/nios2.exp ...
955Running /sources/gcc-5.1.0/gcc/testsuite/gcc.target/powerpc/powerpc.exp ...
956Running /sources/gcc-5.1.0/gcc/testsuite/gcc.target/rx/rx.exp ...
957Running /sources/gcc-5.1.0/gcc/testsuite/gcc.target/s390/s390.exp ...
958Running /sources/gcc-5.1.0/gcc/testsuite/gcc.target/sh/sh.exp ...
959Running /sources/gcc-5.1.0/gcc/testsuite/gcc.target/sh/torture/sh-torture.exp ...
960Running /sources/gcc-5.1.0/gcc/testsuite/gcc.target/sparc/sparc.exp ...
961Running /sources/gcc-5.1.0/gcc/testsuite/gcc.target/spu/ea/ea.exp ...
962Running /sources/gcc-5.1.0/gcc/testsuite/gcc.target/spu/spu.exp ...
963Running /sources/gcc-5.1.0/gcc/testsuite/gcc.target/tic6x/builtins/c6x-builtins.exp ...
964Running /sources/gcc-5.1.0/gcc/testsuite/gcc.target/tic6x/tic6x.exp ...
965Running /sources/gcc-5.1.0/gcc/testsuite/gcc.target/vax/vax.exp ...
966Running /sources/gcc-5.1.0/gcc/testsuite/gcc.target/visium/visium.exp ...
967Running /sources/gcc-5.1.0/gcc/testsuite/gcc.target/x86_64/abi/abi-x86_64.exp ...
968Running /sources/gcc-5.1.0/gcc/testsuite/gcc.target/x86_64/abi/avx/abi-avx.exp ...
969Running /sources/gcc-5.1.0/gcc/testsuite/gcc.target/x86_64/abi/avx512f/abi-avx512f.exp ...
970Running /sources/gcc-5.1.0/gcc/testsuite/gcc.target/x86_64/abi/callabi/callabi.exp ...
971Running /sources/gcc-5.1.0/gcc/testsuite/gcc.target/xstormy16/xstormy16.exp ...
972Running /sources/gcc-5.1.0/gcc/testsuite/gcc.test-framework/test-framework.exp ...
973skipping test framework tests, CHECK_TEST_FRAMEWORK is not defined
974
975                === gcc Summary ===
976
977# of expected passes            12885
978# of expected failures          65
979# of unsupported tests          444
980/sources/gcc-build/gcc/xgcc  version 5.1.0 (GCC)
981
982Running /sources/gcc-5.1.0/gcc/testsuite/gcc.target/x86_64/abi/avx/abi-avx.exp ...
983Running /sources/gcc-5.1.0/gcc/testsuite/gcc.target/x86_64/abi/callabi/callabi.exp ...
984Running /sources/gcc-5.1.0/gcc/testsuite/gcc.target/xstormy16/xstormy16.exp ...
985Running /sources/gcc-5.1.0/gcc/testsuite/gcc.test-framework/test-framework.exp ...
986skipping test framework tests, CHECK_TEST_FRAMEWORK is not defined
987
988                === gcc Summary ===
989
990# of expected passes            90904
991# of expected failures          131
992# of unsupported tests          1156
993/sources/gcc-build/gcc/xgcc  version 5.1.0 (GCC)
994
995Running /sources/gcc-5.1.0/gcc/testsuite/gcc.target/x86_64/abi/avx512f/abi-avx512f.exp ...
996Running /sources/gcc-5.1.0/gcc/testsuite/gcc.target/x86_64/abi/callabi/callabi.exp ...
997Running /sources/gcc-5.1.0/gcc/testsuite/gcc.target/xstormy16/xstormy16.exp ...
998Running /sources/gcc-5.1.0/gcc/testsuite/gcc.test-framework/test-framework.exp ...
999skipping test framework tests, CHECK_TEST_FRAMEWORK is not defined
1000
1001                === gcc Summary ===
1002
1003# of expected passes            10450
1004# of expected failures          68
1005# of unsupported tests          206
1006/sources/gcc-build/gcc/xgcc  version 5.1.0 (GCC)
1007
1008make[3]: Leaving directory '/sources/gcc-build/gcc'
1009make[2]: Leaving directory '/sources/gcc-build/gcc'
1010make[1]: Target 'check-host' not remade because of errors.
1011make[1]: Leaving directory '/sources/gcc-build'
1012Makefile:2261: recipe for target 'do-check' failed
1013make: *** [do-check] Error 2
1014make: Target 'check' not remade because of errors.